program: Orca
programVersion: 5.0.2
elementType: S S S P O O C C C C C C C C C H H H H H H H H H H H H H H H H H H H H H
charge: 0
multiplicity: 1
keywords: wb97x-d3
keywords: def2-TZVPP
keywords: def2/J RIJCOSX
keywords: DEFGRID2
keywords: scfconv7
keywords: smallprint printgap noloewdin
keywords: NOSOSCF
formula: C9H21O2PS3
InChI: InChI=1/C9H21O2PS3/c1-6-10-12(13,11-7-2)15-8-14-9(3,4)5/h6-8H2,1-5H3
36 atoms
S  2.115349 0.07289 -0.941844
S  0.074865 -1.674171 0.596735
S  -1.602107 -0.065726 -1.903644
P  -1.302219 -0.230803 -0.004277
O  -2.484188 -0.789554 0.915033
O  -0.899528 1.131927 0.735188
C  3.523167 0.054801 0.250517
C  4.107332 1.460484 0.13536
C  3.052844 -0.198841 1.674745
C  4.559618 -0.978158 -0.170032
C  1.312905 -1.520766 -0.735778
C  -3.737632 -0.097195 1.082357
C  -0.584877 2.364456 0.06486
C  -4.792195 -0.638382 0.149056
C  -1.796216 3.258848 -0.020468
H  4.432442 1.68631 -0.882105
H  3.388886 2.223073 0.440877
H  4.980126 1.547501 0.785738
H  2.274136 0.502208 1.97558
H  3.8959 -0.082297 2.36095
H  2.666542 -1.209421 1.80804
H  4.163735 -1.994831 -0.14853
H  4.935669 -0.783451 -1.174714
H  5.409038 -0.952702 0.517483
H  0.824991 -1.75489 -1.681612
H  2.036643 -2.313768 -0.544322
H  -4.018328 -0.260607 2.122759
H  -3.609304 0.979164 0.945965
H  0.205538 2.824768 0.657592
H  -0.179129 2.162488 -0.926581
H  -4.563185 -0.415824 -0.892388
H  -4.906576 -1.717194 0.259167
H  -5.750308 -0.175943 0.389996
H  -2.577907 2.8144 -0.6377
H  -2.209093 3.477931 0.964836
H  -1.510717 4.206545 -0.479637
elementType: S P O C H
totalener: -2042.19762406 hartree
nucrepener: 1724.07985899 hartree
electener: -3766.27748305 hartree
oneelecener: -6243.77289861 hartree
twoeener: 2477.49541556 hartree
cpcmener: -0.01732710 hartree
kineticenergy: 2036.96312815 hartree
xcener: -124.859124261242 hartree
chargesum: 0.0000000
charge: -0.176271 -0.154159 -0.457712 0.647347 -0.345451 -0.347237 0.195031 -0.295759 -0.325298 -0.320254 -0.148106 0.027178 0.068164 -0.237707 -0.261681 0.104858 0.105089 0.098649 0.098808 0.103723 0.092328 0.100806 0.097276 0.098774 0.159399 0.154037 0.105750 0.094985 0.104026 0.082089 0.075978 0.089039 0.093680 0.076947 0.092403 0.103270
qa: -0.1763 -0.1542 -0.4577 0.6473 -0.3455 -0.3472 0.1950 -0.2958 -0.3253 -0.3203 -0.1481 0.0272 0.0682 -0.2377 -0.2617 0.1049 0.1051 0.0986 0.0988 0.1037 0.0923 0.1008 0.0973 0.0988 0.1594 0.1540 0.1057 0.0950 0.1040 0.0821 0.0760 0.0890 0.0937 0.0769 0.0924 0.1033
va: 2.2369 2.3012 1.9714 5.4177 2.1122 2.0597 3.8597 3.8745 3.9316 3.9336 3.9854 3.9020 3.8110 3.9154 3.9501 1.0096 1.0086 1.0046 1.0127 1.0067 1.0029 1.0043 1.0135 1.0031 1.0197 1.0044 0.9924 0.9871 0.9915 1.0165 1.0207 1.0045 1.0085 1.0129 1.0021 1.0102
dispcorr: -0.018216436 hartree
energy: -2042.215840495651
dipole: 10.23418 -9.57809 0.65609 10.34211 -9.58842 0.75369 6.28949 -5.12007 1.16943
magnitude: 1.53820 au
magnitude: 3.90980 debye
