program: Orca
programVersion: 5.0.2
elementType: S S S P O O C C C C C C C C C H H H H H H H H H H H H H H H H H H H H H
charge: 0
multiplicity: 1
keywords: wb97x-d3
keywords: def2-TZVPP
keywords: def2/J RIJCOSX
keywords: DEFGRID2
keywords: scfconv7
keywords: smallprint printgap noloewdin
keywords: NOSOSCF
formula: C9H21O2PS3
InChI: InChI=1/C9H21O2PS3/c1-6-10-12(13,11-7-2)15-8-14-9(3,4)5/h6-8H2,1-5H3
36 atoms
S  2.059807 -0.158564 -0.959541
S  -0.033929 -1.592174 0.823054
S  -1.526057 -0.07691 -1.82954
P  -1.236315 -0.062662 0.077047
O  -2.529319 -0.213741 1.009588
O  -0.596345 1.253259 0.709601
C  3.464352 -0.019688 0.22883
C  4.073589 1.343303 -0.093236
C  2.984888 -0.047447 1.672212
C  4.482714 -1.121842 -0.025346
C  1.216155 -1.680856 -0.514119
C  -3.529593 -1.217093 0.748669
C  -0.567662 2.516886 0.022349
C  -4.754289 -0.592115 0.12716
C  -1.901235 3.222086 0.071711
H  4.403586 1.410133 -1.13196
H  3.369264 2.15607 0.092894
H  4.947547 1.510764 0.539572
H  2.225303 0.711073 1.862189
H  3.829443 0.145862 2.338939
H  2.5692 -1.016188 1.949855
H  4.849386 -1.099713 -1.051775
H  5.340292 -0.997164 0.640689
H  4.071892 -2.114477 0.166035
H  0.716838 -2.036733 -1.414481
H  1.916906 -2.456542 -0.203815
H  -3.128974 -2.009243 0.10978
H  -3.763356 -1.665789 1.714607
H  0.200098 3.095271 0.53463
H  -0.238981 2.367024 -1.007361
H  -5.162202 0.198804 0.758048
H  -4.533383 -0.174681 -0.855285
H  -5.525768 -1.353025 0.004981
H  -2.669012 2.676808 -0.478162
H  -2.242886 3.366957 1.096919
H  -1.801717 4.205536 -0.389773
elementType: S P O C H
totalener: -2042.19793820 hartree
nucrepener: 1734.33757820 hartree
electener: -3776.53551641 hartree
oneelecener: -6264.47279000 hartree
twoeener: 2487.93727360 hartree
cpcmener: -0.01641422 hartree
kineticenergy: 2036.97243776 hartree
xcener: -124.860403623266 hartree
chargesum: 0.0000000
charge: -0.170489 -0.167360 -0.459393 0.662720 -0.360390 -0.340140 0.193235 -0.296265 -0.324955 -0.318595 -0.135717 0.042440 0.049217 -0.243171 -0.241473 0.104482 0.105409 0.098117 0.098035 0.104094 0.091885 0.096602 0.098232 0.100039 0.158577 0.149626 0.083167 0.107174 0.105317 0.086605 0.089868 0.076281 0.094774 0.076054 0.090608 0.095391
qa: -0.1705 -0.1674 -0.4594 0.6627 -0.3604 -0.3401 0.1932 -0.2963 -0.3250 -0.3186 -0.1357 0.0424 0.0492 -0.2432 -0.2415 0.1045 0.1054 0.0981 0.0980 0.1041 0.0919 0.0966 0.0982 0.1000 0.1586 0.1496 0.0832 0.1072 0.1053 0.0866 0.0899 0.0763 0.0948 0.0761 0.0906 0.0954
va: 2.2432 2.2860 1.9700 5.4077 2.0855 2.0889 3.8574 3.8775 3.9248 3.9341 3.9804 3.8626 3.8380 3.9341 3.9412 1.0094 1.0087 1.0044 1.0149 1.0068 1.0053 1.0143 1.0033 1.0039 1.0182 1.0060 1.0124 0.9942 0.9892 1.0161 1.0030 1.0190 1.0089 1.0163 1.0059 1.0085
dispcorr: -0.018085823 hartree
energy: -2042.216024027610
dipole: 9.65206 -9.03628 0.61578 7.14133 -7.25761 -0.11628 5.02473 -4.09133 0.93340
magnitude: 1.12425 au
magnitude: 2.85761 debye
