program: Orca
programVersion: 5.0.2
elementType: S S S P O O C C C C C C C C C H H H H H H H H H H H H H H H H H H H H H
charge: 0
multiplicity: 1
keywords: wb97x-d3
keywords: def2-TZVPP
keywords: def2/J RIJCOSX
keywords: DEFGRID2
keywords: scfconv7
keywords: smallprint printgap noloewdin
keywords: NOSOSCF
formula: C9H21O2PS3
InChI: InChI=1/C9H21O2PS3/c1-6-10-12(13,11-7-2)15-8-14-9(3,4)5/h6-8H2,1-5H3
36 atoms
S  1.708828 -1.470043 -0.807084
S  0.865797 1.433661 -0.088921
S  -1.779625 0.152301 -1.806577
P  -1.095345 0.744879 -0.10365
O  -1.119466 -0.310845 1.089416
O  -1.84318 1.989007 0.578231
C  3.034337 -1.631795 0.466345
C  4.351001 -1.063302 -0.040744
C  2.633377 -0.976856 1.781655
C  3.153858 -3.141991 0.656747
C  1.661429 0.266594 -1.250705
C  -2.274972 -1.142456 1.335846
C  -2.214429 3.15062 -0.191248
C  -1.958256 -2.579582 1.013274
C  -3.704721 3.180334 -0.414045
H  4.311856 0.019658 -0.167459
H  5.143394 -1.268611 0.683396
H  4.643441 -1.508465 -0.992433
H  3.378932 -1.208203 2.547177
H  1.667043 -1.33879 2.134372
H  2.575023 0.107667 1.700675
H  3.914872 -3.353601 1.410778
H  2.21727 -3.583846 1.002873
H  3.449289 -3.647784 -0.263935
H  2.65963 0.671861 -1.417985
H  1.130265 0.3237 -2.20109
H  -2.515305 -1.017164 2.391783
H  -3.135448 -0.79549 0.759277
H  -1.883701 4.013602 0.38694
H  -1.680087 3.170726 -1.144311
H  -2.805668 -3.206404 1.29384
H  -1.773369 -2.718505 -0.051635
H  -1.085917 -2.929489 1.566556
H  -4.035184 2.330266 -1.011159
H  -4.250208 3.177813 0.53021
H  -3.970553 4.09199 -0.950883
elementType: S P O C H
totalener: -2042.19906714 hartree
nucrepener: 1722.64302242 hartree
electener: -3764.84208956 hartree
oneelecener: -6241.12990703 hartree
twoeener: 2476.28781747 hartree
cpcmener: -0.01682587 hartree
kineticenergy: 2036.96658652 hartree
xcener: -124.857158719423 hartree
chargesum: -0.0000000
charge: -0.160680 -0.157225 -0.462238 0.656021 -0.331451 -0.361292 0.186093 -0.327128 -0.334187 -0.288207 -0.148061 0.044977 0.042940 -0.244548 -0.237847 0.098534 0.100160 0.101929 0.103162 0.094815 0.098885 0.096806 0.105015 0.104325 0.156798 0.158130 0.105986 0.087259 0.108252 0.082230 0.099406 0.077181 0.085985 0.075750 0.089350 0.092874
qa: -0.1607 -0.1572 -0.4622 0.6560 -0.3315 -0.3613 0.1861 -0.3271 -0.3342 -0.2882 -0.1481 0.0450 0.0429 -0.2445 -0.2378 0.0985 0.1002 0.1019 0.1032 0.0948 0.0989 0.0968 0.1050 0.1043 0.1568 0.1581 0.1060 0.0873 0.1083 0.0822 0.0994 0.0772 0.0860 0.0757 0.0893 0.0929
va: 2.2517 2.2974 1.9714 5.4195 2.0978 2.0853 3.8833 3.9214 3.9214 3.8578 4.0040 3.8486 3.8531 3.9422 3.9414 1.0006 1.0036 1.0131 1.0074 1.0161 1.0139 1.0050 1.0094 1.0126 0.9988 1.0191 0.9972 1.0106 0.9942 1.0140 1.0115 1.0141 1.0030 1.0188 1.0034 1.0085
dispcorr: -0.018018238 hartree
energy: -2042.217085377478
dipole: 7.82874 -7.24860 0.58014 -8.62079 9.05021 0.42942 8.84297 -7.88938 0.95358
magnitude: 1.19595 au
magnitude: 3.03986 debye
