program: Orca
programVersion: 5.0.2
elementType: S S S P O O C C C C C C C C C H H H H H H H H H H H H H H H H H H H H H
charge: 0
multiplicity: 1
keywords: wb97x-d3
keywords: def2-TZVPP
keywords: def2/J RIJCOSX
keywords: DEFGRID2
keywords: scfconv7
keywords: smallprint printgap noloewdin
keywords: NOSOSCF
formula: C9H21O2PS3
InChI: InChI=1/C9H21O2PS3/c1-6-10-12(13,11-7-2)15-8-14-9(3,4)5/h6-8H2,1-5H3
36 atoms
S  1.744755 -1.080999 -0.942052
S  0.67992 1.430254 0.516654
S  -1.663148 0.463015 -1.768315
P  -1.199193 0.649291 0.095132
O  -1.248094 -0.671199 0.988647
O  -2.124964 1.628918 0.965038
C  3.10337 -1.561302 0.20837
C  2.996875 -3.082313 0.277334
C  4.450066 -1.153127 -0.372517
C  2.910877 -0.964151 1.594523
C  1.67032 0.707762 -0.845075
C  -2.307431 -1.641704 0.830282
C  -2.535342 2.912216 0.45126
C  -1.806081 -2.863974 0.1050
C  -3.995268 2.884302 0.077861
H  3.081938 -3.545214 -0.707912
H  3.805249 -3.477919 0.895931
H  2.052452 -3.400196 0.722001
H  4.616615 -1.600796 -1.35297
H  5.257095 -1.481105 0.288029
H  4.540182 -0.070147 -0.476158
H  3.047689 0.117369 1.601254
H  1.922278 -1.18386 1.997478
H  3.655238 -1.385556 2.275211
H  2.662208 1.150102 -0.742166
H  1.254973 1.062818 -1.787526
H  -2.633552 -1.888546 1.840355
H  -3.160613 -1.203548 0.307866
H  -2.343054 3.632093 1.246785
H  -1.922463 3.200176 -0.406452
H  -2.601195 -3.610063 0.070464
H  -1.517653 -2.630514 -0.91921
H  -0.951162 -3.309297 0.614531
H  -4.183888 2.183477 -0.735385
H  -4.619538 2.609365 0.928552
H  -4.302324 3.876472 -0.255003
elementType: S P O C H
totalener: -2042.19866111 hartree
nucrepener: 1724.62244284 hartree
electener: -3766.82110396 hartree
oneelecener: -6245.11590095 hartree
twoeener: 2478.29479700 hartree
cpcmener: -0.01708371 hartree
kineticenergy: 2036.96835399 hartree
xcener: -124.857423563552 hartree
chargesum: -0.0000000
charge: -0.167373 -0.157704 -0.462261 0.663588 -0.338152 -0.363728 0.192259 -0.293585 -0.320122 -0.321310 -0.140263 0.051366 0.042080 -0.244383 -0.237409 0.104601 0.098103 0.104674 0.096617 0.098328 0.098898 0.088769 0.096353 0.104713 0.151171 0.158782 0.104885 0.085438 0.107837 0.081229 0.099948 0.077238 0.082393 0.075625 0.088915 0.092481
qa: -0.1674 -0.1577 -0.4623 0.6636 -0.3382 -0.3637 0.1923 -0.2936 -0.3201 -0.3213 -0.1403 0.0514 0.0421 -0.2444 -0.2374 0.1046 0.0981 0.1047 0.0966 0.0983 0.0989 0.0888 0.0964 0.1047 0.1512 0.1588 0.1049 0.0854 0.1078 0.0812 0.0999 0.0772 0.0824 0.0756 0.0889 0.0925
va: 2.2450 2.2965 1.9676 5.4071 2.0924 2.0834 3.8618 3.8794 3.9388 3.9248 3.9893 3.8505 3.8566 3.9355 3.9413 1.0088 1.0047 1.0080 1.0139 1.0032 1.0040 1.0013 1.0191 1.0072 1.0051 1.0185 0.9966 1.0110 0.9943 1.0148 1.0114 1.0150 1.0040 1.0189 1.0035 1.0086
dispcorr: -0.017870787 hartree
energy: -2042.216531901294
dipole: 8.51636 -7.94877 0.56759 -10.42714 10.57723 0.15009 5.25622 -4.30410 0.95212
magnitude: 1.11858 au
magnitude: 2.84321 debye
