program: Orca
programVersion: 5.0.2
elementType: S S S P O O C C C C C C C C C H H H H H H H H H H H H H H H H H H H H H
charge: 0
multiplicity: 1
keywords: wb97x-d3
keywords: def2-TZVPP
keywords: def2/J RIJCOSX
keywords: DEFGRID2
keywords: scfconv7
keywords: smallprint printgap noloewdin
keywords: NOSOSCF
formula: C9H21O2PS3
InChI: InChI=1/C9H21O2PS3/c1-6-10-12(13,11-7-2)15-8-14-9(3,4)5/h6-8H2,1-5H3
36 atoms
S  2.096501 0.073969 -0.94273
S  0.069515 -1.681862 0.604398
S  -1.589351 -0.040728 -1.888374
P  -1.293681 -0.222584 0.010388
O  -2.487135 -0.774893 0.919134
O  -0.879017 1.129786 0.763221
C  3.511099 0.065223 0.240247
C  4.099155 1.467912 0.104548
C  3.048993 -0.169349 1.670909
C  4.54065 -0.976348 -0.175133
C  1.304581 -1.523917 -0.732249
C  -3.744888 -0.076413 1.032626
C  -0.570567 2.369273 0.103605
C  -4.784821 -0.675009 0.117827
C  -1.785354 3.2610 0.03436
H  4.976379 1.559782 0.748136
H  4.418463 1.681244 -0.917829
H  3.385037 2.236674 0.405892
H  3.896299 -0.045927 2.35078
H  2.660908 -1.177328 1.819452
H  2.273444 0.537123 1.96784
H  4.89732 -0.804847 -1.190332
H  5.402248 -0.934836 0.495291
H  4.146487 -1.992262 -0.121821
H  0.814959 -1.7623 -1.676291
H  2.033377 -2.311395 -0.540989
H  -4.039231 -0.177597 2.07718
H  -3.618782 0.99053 0.834245
H  0.222303 2.825422 0.696099
H  -0.169478 2.178153 -0.891513
H  -4.909865 -1.742793 0.299302
H  -5.74367 -0.191484 0.304471
H  -4.531654 -0.526693 -0.930662
H  -2.56594 2.823627 -0.589471
H  -2.19842 3.460274 1.023924
H  -1.504942 4.218064 -0.40818
elementType: S P O C H
totalener: -2042.19756234 hartree
nucrepener: 1726.24932211 hartree
electener: -3768.44688445 hartree
oneelecener: -6248.11270632 hartree
twoeener: 2479.66582188 hartree
cpcmener: -0.01733168 hartree
kineticenergy: 2036.96724579 hartree
xcener: -124.859900852088 hartree
chargesum: 0.0000000
charge: -0.176070 -0.154978 -0.458084 0.649737 -0.347094 -0.347255 0.194858 -0.295804 -0.325694 -0.320709 -0.147862 0.027012 0.068904 -0.237665 -0.262525 0.098729 0.104978 0.105194 0.103835 0.092408 0.098783 0.097663 0.098804 0.100962 0.159411 0.154305 0.105938 0.094855 0.103801 0.082303 0.089296 0.093158 0.076048 0.076925 0.092704 0.103129
qa: -0.1761 -0.1550 -0.4581 0.6497 -0.3471 -0.3473 0.1949 -0.2958 -0.3257 -0.3207 -0.1479 0.0270 0.0689 -0.2377 -0.2625 0.0987 0.1050 0.1052 0.1038 0.0924 0.0988 0.0977 0.0988 0.1010 0.1594 0.1543 0.1059 0.0949 0.1038 0.0823 0.0893 0.0932 0.0760 0.0769 0.0927 0.1031
va: 2.2381 2.2989 1.9700 5.4141 2.1090 2.0592 3.8604 3.8737 3.9313 3.9319 3.9843 3.9036 3.8098 3.9191 3.9512 1.0046 1.0097 1.0084 1.0067 1.0034 1.0123 1.0138 1.0032 1.0041 1.0197 1.0045 0.9931 0.9863 0.9915 1.0165 1.0045 1.0085 1.0211 1.0124 1.0021 1.0101
dispcorr: -0.018257508 hartree
energy: -2042.215819844459
dipole: 10.19763 -9.53808 0.65956 10.30732 -9.55682 0.75050 6.10138 -4.97089 1.13050
magnitude: 1.50874 au
magnitude: 3.83491 debye
