program: Orca
programVersion: 5.0.2
elementType: S S S P O O C C C C C C C C C H H H H H H H H H H H H H H H H H H H H H
charge: 0
multiplicity: 1
keywords: wb97x-d3
keywords: def2-TZVPP
keywords: def2/J RIJCOSX
keywords: DEFGRID2
keywords: scfconv7
keywords: smallprint printgap noloewdin
keywords: NOSOSCF
formula: C9H21O2PS3
InChI: InChI=1/C9H21O2PS3/c1-6-10-12(13,11-7-2)15-8-14-9(3,4)5/h6-8H2,1-5H3
36 atoms
S  2.119657 0.451896 -0.810468
S  -0.051102 -1.509944 0.216248
S  -1.901419 0.57614 -1.764427
P  -1.444919 0.022225 0.027071
O  -2.651887 -0.547791 0.915044
O  -0.854712 1.143307 0.998536
C  3.54949 -0.096199 0.219132
C  3.099789 -0.836719 1.469932
C  4.487759 -0.961205 -0.610684
C  4.239627 1.208829 0.60574
C  1.158998 -1.038874 -1.075645
C  -3.802291 -1.213828 0.366342
C  -1.432498 2.467106 1.046674
C  -3.518989 -2.643285 -0.02443
C  -0.529267 3.463013 0.365401
H  3.968312 -1.033896 2.103863
H  2.382376 -0.25747 2.05097
H  2.648589 -1.802206 1.239479
H  4.845184 -0.430318 -1.493494
H  4.008851 -1.884248 -0.94229
H  5.358314 -1.247902 -0.014789
H  4.548455 1.784073 -0.269218
H  3.594813 1.840667 1.21862
H  5.138007 0.988164 1.186156
H  0.617325 -0.914243 -2.013286
H  1.799368 -1.914279 -1.192919
H  -4.55049 -1.171389 1.15721
H  -4.181882 -0.643394 -0.483836
H  -2.427878 2.475737 0.597138
H  -1.549949 2.700904 2.104791
H  -3.109543 -3.215845 0.808184
H  -4.454224 -3.116967 -0.3258
H  -2.829687 -2.710399 -0.866291
H  -0.947957 4.463919 0.477874
H  0.467506 3.466212 0.807237
H  -0.437686 3.253183 -0.699893
elementType: S P O C H
totalener: -2042.19891565 hartree
nucrepener: 1717.47479667 hartree
electener: -3759.67371232 hartree
oneelecener: -6230.82808338 hartree
twoeener: 2471.15437107 hartree
cpcmener: -0.01718884 hartree
kineticenergy: 2036.95896162 hartree
xcener: -124.856052902587 hartree
chargesum: -0.0000000
charge: -0.168071 -0.149609 -0.464709 0.655677 -0.362065 -0.337205 0.191112 -0.321541 -0.319979 -0.291188 -0.147200 0.037584 0.047663 -0.247205 -0.242511 0.103992 0.098773 0.087913 0.096375 0.099829 0.098367 0.104504 0.104979 0.097002 0.159409 0.152764 0.105764 0.092652 0.085575 0.104536 0.090722 0.100937 0.076204 0.099280 0.082729 0.076940
qa: -0.1681 -0.1496 -0.4647 0.6557 -0.3621 -0.3372 0.1911 -0.3215 -0.3200 -0.2912 -0.1472 0.0376 0.0477 -0.2472 -0.2425 0.1040 0.0988 0.0879 0.0964 0.0998 0.0984 0.1045 0.1050 0.0970 0.1594 0.1528 0.1058 0.0927 0.0856 0.1045 0.0907 0.1009 0.0762 0.0993 0.0827 0.0769
va: 2.2423 2.2972 1.9724 5.4055 2.0988 2.0951 3.8689 3.9264 3.9378 3.8716 4.0013 3.8672 3.8575 3.8932 3.9296 1.0071 1.0170 1.0009 1.0142 1.0038 1.0031 1.0093 1.0104 1.0046 1.0209 1.0035 0.9911 1.0133 1.0100 0.9963 1.0039 1.0112 1.0191 1.0111 1.0072 1.0160
dispcorr: -0.017626241 hartree
energy: -2042.216541889931
dipole: 14.77136 -14.39473 0.37664 0.62080 -1.14645 -0.52565 5.85452 -4.93818 0.91634
magnitude: 1.12154 au
magnitude: 2.85072 debye
