program: Orca
programVersion: 5.0.2
elementType: S S S P O O C C C C C C C C C H H H H H H H H H H H H H H H H H H H H H
charge: 0
multiplicity: 1
keywords: wb97x-d3
keywords: def2-TZVPP
keywords: def2/J RIJCOSX
keywords: DEFGRID2
keywords: scfconv7
keywords: smallprint printgap noloewdin
keywords: NOSOSCF
formula: C9H21O2PS3
InChI: InChI=1/C9H21O2PS3/c1-6-10-12(13,11-7-2)15-8-14-9(3,4)5/h6-8H2,1-5H3
36 atoms
S  1.617172 -1.454877 -0.791647
S  0.789276 1.458229 -0.102727
S  -1.73661 0.106892 -1.93768
P  -1.147033 0.711553 -0.204666
O  -1.187519 -0.346961 0.984988
O  -1.968969 1.92377 0.448285
C  2.946662 -1.68839 0.465375
C  4.31581 -1.506803 -0.174726
C  2.774178 -0.74873 1.649101
C  2.764432 -3.134119 0.919572
C  1.66491 0.289573 -1.208446
C  -2.222414 -1.338284 1.135643
C  -2.320565 3.10534 -0.294822
C  -1.593591 -2.61742 1.623341
C  -3.672001 3.584472 0.168048
H  5.099699 -1.667329 0.570223
H  4.474552 -2.216149 -0.987672
H  4.454016 -0.499993 -0.573062
H  1.77936 -0.826723 2.087852
H  2.94238 0.293247 1.377849
H  3.505241 -1.003217 2.421021
H  2.846551 -3.838382 0.089678
H  3.540806 -3.38894 1.644059
H  1.797536 -3.286865 1.402295
H  2.687673 0.665097 -1.261155
H  1.235177 0.385619 -2.205049
H  -2.952478 -0.955261 1.850573
H  -2.733428 -1.497429 0.183716
H  -1.553379 3.86166 -0.117999
H  -2.337937 2.886101 -1.365246
H  -0.896956 -3.019334 0.888178
H  -1.062957 -2.471646 2.564998
H  -2.373263 -3.360693 1.792136
H  -3.933058 4.495293 -0.37175
H  -4.44733 2.844211 -0.030484
H  -3.675448 3.81711 1.233273
elementType: S P O C H
totalener: -2042.19932019 hartree
nucrepener: 1718.81536460 hartree
electener: -3761.01468479 hartree
oneelecener: -6233.41580182 hartree
twoeener: 2472.40111703 hartree
cpcmener: -0.01686993 hartree
kineticenergy: 2036.97167644 hartree
xcener: -124.858379868894 hartree
chargesum: -0.0000000
charge: -0.167905 -0.161252 -0.462733 0.657369 -0.324205 -0.358090 0.192057 -0.319507 -0.322339 -0.296540 -0.139890 0.041311 0.033877 -0.248147 -0.237075 0.098246 0.096795 0.100013 0.094878 0.091738 0.103594 0.105445 0.099452 0.104450 0.151449 0.160150 0.107544 0.086061 0.100173 0.087343 0.076090 0.091483 0.097691 0.087357 0.084489 0.088627
qa: -0.1679 -0.1613 -0.4627 0.6574 -0.3242 -0.3581 0.1921 -0.3195 -0.3223 -0.2965 -0.1399 0.0413 0.0339 -0.2481 -0.2371 0.0982 0.0968 0.1000 0.0949 0.0917 0.1036 0.1054 0.0995 0.1045 0.1514 0.1602 0.1075 0.0861 0.1002 0.0873 0.0761 0.0915 0.0977 0.0874 0.0845 0.0886
va: 2.2435 2.2896 1.9836 5.4265 2.1051 2.1004 3.8642 3.9362 3.9260 3.8777 3.9878 3.8345 3.8581 3.9382 3.9561 1.0033 1.0132 1.0041 1.0180 1.0030 1.0072 1.0094 1.0048 1.0058 1.0043 1.0166 0.9957 1.0151 0.9940 1.0090 1.0124 1.0011 1.0118 1.0073 1.0082 1.0037
dispcorr: -0.017676783 hartree
energy: -2042.216996973797
dipole: 8.84616 -8.15946 0.68670 -8.41743 8.73376 0.31632 11.53361 -10.50396 1.02965
magnitude: 1.27742 au
magnitude: 3.24694 debye
