program: Orca
programVersion: 5.0.2
elementType: S S S P O O C C C C C C C C C H H H H H H H H H H H H H H H H H H H H H
charge: 0
multiplicity: 1
keywords: wb97x-d3
keywords: def2-TZVPP
keywords: def2/J RIJCOSX
keywords: DEFGRID2
keywords: scfconv7
keywords: smallprint printgap noloewdin
keywords: NOSOSCF
formula: C9H21O2PS3
InChI: InChI=1/C9H21O2PS3/c1-6-10-12(13,11-7-2)15-8-14-9(3,4)5/h6-8H2,1-5H3
36 atoms
S  2.966246 -0.148225 1.038376
S  -0.021877 -0.186919 1.405639
S  -1.041293 0.434541 -1.80142
P  -1.494233 0.434946 0.078941
O  -2.717115 -0.503483 0.507823
O  -1.926409 1.847865 0.686158
C  3.175151 -1.150975 -0.498932
C  3.335654 -0.240493 -1.708317
C  4.466955 -1.924284 -0.250952
C  2.013768 -2.114022 -0.701009
C  1.432163 0.7457 0.783249
C  -3.089408 -1.70188 -0.197724
C  -2.833927 2.7180 -0.027057
C  -2.203442 -2.874386 0.143609
C  -2.098961 3.941467 -0.510039
H  3.545728 -0.842104 -2.596207
H  2.428696 0.327913 -1.920284
H  4.157135 0.464402 -1.577943
H  4.69255 -2.541881 -1.122704
H  4.386167 -2.587914 0.611622
H  5.317329 -1.258772 -0.091381
H  2.222589 -2.757172 -1.560016
H  1.861833 -2.75318 0.168867
H  1.079864 -1.590777 -0.908373
H  1.499835 1.681306 1.335888
H  1.282236 0.987687 -0.269432
H  -4.118287 -1.893368 0.104602
H  -3.086744 -1.507974 -1.272261
H  -3.302983 2.192485 -0.86188
H  -3.620646 2.979862 0.680556
H  -1.182863 -2.738599 -0.215996
H  -2.173326 -3.056889 1.218154
H  -2.604033 -3.768914 -0.335185
H  -2.800239 4.61092 -1.009568
H  -1.646784 4.488977 0.317459
H  -1.317805 3.678662 -1.223542
elementType: S P O C H
totalener: -2042.19877743 hartree
nucrepener: 1705.12854341 hartree
electener: -3747.32732084 hartree
oneelecener: -6205.52153628 hartree
twoeener: 2458.19421544 hartree
cpcmener: -0.01492831 hartree
kineticenergy: 2036.95828978 hartree
xcener: -124.856422058033 hartree
chargesum: -0.0000000
charge: -0.166340 -0.146738 -0.463159 0.664401 -0.355554 -0.351936 0.190305 -0.319850 -0.290130 -0.295418 -0.114778 0.041882 0.043989 -0.243554 -0.235803 0.100368 0.096692 0.099147 0.097492 0.105055 0.104887 0.103878 0.099240 0.045729 0.163727 0.113250 0.106763 0.092990 0.083518 0.104775 0.073884 0.092817 0.100756 0.092465 0.089281 0.075967
qa: -0.1663 -0.1467 -0.4632 0.6644 -0.3556 -0.3519 0.1903 -0.3199 -0.2901 -0.2954 -0.1148 0.0419 0.0440 -0.2436 -0.2358 0.1004 0.0967 0.0991 0.0975 0.1051 0.1049 0.1039 0.0992 0.0457 0.1637 0.1133 0.1068 0.0930 0.0835 0.1048 0.0739 0.0928 0.1008 0.0925 0.0893 0.0760
va: 2.2360 2.2980 1.9675 5.4076 2.1020 2.1007 3.8831 3.9411 3.8613 3.9042 3.9757 3.8578 3.8631 3.9124 3.9334 1.0032 1.0033 1.0149 1.0041 1.0110 1.0111 1.0098 1.0139 1.0369 1.0027 1.0517 0.9913 1.0138 1.0112 0.9967 1.0000 1.0037 1.0131 1.0085 1.0039 1.0167
dispcorr: -0.018249923 hartree
energy: -2042.217027348707
dipole: 7.58265 -8.28282 -0.70017 -5.95785 5.83463 -0.12321 -9.68161 9.14829 -0.53332
magnitude: 0.88874 au
magnitude: 2.25899 debye
