program: Orca
programVersion: 5.0.2
elementType: S S S P O O C C C C C C C C C H H H H H H H H H H H H H H H H H H H H H
charge: 0
multiplicity: 1
keywords: wb97x-d3
keywords: def2-TZVPP
keywords: def2/J RIJCOSX
keywords: DEFGRID2
keywords: scfconv7
keywords: smallprint printgap noloewdin
keywords: NOSOSCF
formula: C9H21O2PS3
InChI: InChI=1/C9H21O2PS3/c1-6-10-12(13,11-7-2)15-8-14-9(3,4)5/h6-8H2,1-5H3
36 atoms
S  3.005129 0.092151 0.857615
S  0.06619 0.702349 1.399743
S  -0.877722 0.56896 -1.905649
P  -1.399858 0.380863 -0.054351
O  -1.899579 -1.061743 0.415437
O  -2.647235 1.283122 0.390688
C  2.940422 -1.357257 -0.281565
C  1.652637 -2.149299 -0.115009
C  3.110553 -0.90814 -1.725919
C  4.137107 -2.20191 0.149245
C  1.578552 1.094333 0.434939
C  -2.914333 -1.781175 -0.31826
C  -2.876951 2.607368 -0.122099
C  -2.735963 -3.252174 -0.047027
C  -1.881797 3.623378 0.383642
H  0.788657 -1.60137 -0.487947
H  1.717807 -3.072137 -0.697745
H  1.468956 -2.420619 0.924396
H  2.28078 -0.285586 -2.064105
H  3.141204 -1.781119 -2.383058
H  4.035848 -0.348958 -1.867593
H  4.042165 -2.547512 1.179963
H  4.206477 -3.084067 -0.490491
H  5.077813 -1.655639 0.057863
H  1.838759 2.124468 0.672513
H  1.345974 1.056484 -0.630073
H  -3.896671 -1.43434 0.007284
H  -2.816836 -1.573169 -1.386471
H  -2.879997 2.57509 -1.213775
H  -3.884508 2.858444 0.206777
H  -2.848784 -3.485534 1.01204
H  -3.494797 -3.812287 -0.594311
H  -1.758159 -3.601956 -0.379803
H  -2.192207 4.612635 0.044731
H  -1.838688 3.641491 1.472502
H  -0.877076 3.446978 -0.002344
elementType: S P O C H
totalener: -2042.19727179 hartree
nucrepener: 1712.29212661 hartree
electener: -3754.48939840 hartree
oneelecener: -6219.96210869 hartree
twoeener: 2465.47271029 hartree
cpcmener: -0.01501116 hartree
kineticenergy: 2036.95769676 hartree
xcener: -124.855824351335 hartree
chargesum: -0.0000000
charge: -0.165306 -0.146375 -0.451850 0.658568 -0.341518 -0.358374 0.192270 -0.301219 -0.320478 -0.294128 -0.126839 0.031109 0.031088 -0.238099 -0.243841 0.049578 0.103635 0.101387 0.095684 0.100302 0.098472 0.105885 0.097856 0.104280 0.164050 0.122523 0.108027 0.089620 0.094498 0.107691 0.089547 0.089858 0.085143 0.101157 0.090683 0.075116
qa: -0.1653 -0.1464 -0.4519 0.6586 -0.3415 -0.3584 0.1923 -0.3012 -0.3205 -0.2941 -0.1268 0.0311 0.0311 -0.2381 -0.2438 0.0496 0.1036 0.1014 0.0957 0.1003 0.0985 0.1059 0.0979 0.1043 0.1641 0.1225 0.1080 0.0896 0.0945 0.1077 0.0895 0.0899 0.0851 0.1012 0.0907 0.0751
va: 2.2353 2.2935 1.9892 5.3919 2.0993 2.1067 3.8841 3.9139 3.9401 3.8631 3.9801 3.8499 3.8661 3.9527 3.9026 1.0291 1.0093 1.0165 1.0077 1.0033 1.0150 1.0104 1.0041 1.0116 0.9943 1.0581 0.9960 1.0079 1.0110 0.9908 1.0035 1.0078 1.0040 1.0115 1.0065 1.0104
dispcorr: -0.018523513 hartree
energy: -2042.215795307214
dipole: 4.76199 -5.62076 -0.85877 -9.90405 9.87525 -0.02881 -5.90617 5.47520 -0.43098
magnitude: 0.96128 au
magnitude: 2.44337 debye
