program: Orca
programVersion: 5.0.2
elementType: S S S P O O C C C C C C C C C H H H H H H H H H H H H H H H H H H H H H
charge: 0
multiplicity: 1
keywords: wb97x-d3
keywords: def2-TZVPP
keywords: def2/J RIJCOSX
keywords: DEFGRID2
keywords: scfconv7
keywords: smallprint printgap noloewdin
keywords: NOSOSCF
formula: C9H21O2PS3
InChI: InChI=1/C9H21O2PS3/c1-6-10-12(13,11-7-2)15-8-14-9(3,4)5/h6-8H2,1-5H3
36 atoms
S  2.737532 -0.019438 1.062503
S  -0.249964 0.027623 1.170283
S  -1.024117 0.886843 -2.031951
P  -1.700426 0.46725 -0.273454
O  -2.657595 -0.80367 -0.121601
O  -2.718786 1.529941 0.349893
C  3.075871 -1.162074 -0.347992
C  1.855818 -1.99993 -0.701338
C  3.544913 -0.367114 -1.559055
C  4.200767 -2.056562 0.164957
C  1.259964 0.863955 0.556209
C  -2.246222 -2.103467 -0.593602
C  -2.616113 2.941849 0.096771
C  -2.167539 -3.077495 0.553437
C  -1.435376 3.582161 0.785271
H  2.132168 -2.730036 -1.466483
H  1.469049 -2.545018 0.159807
H  1.047927 -1.393851 -1.113217
H  4.439439 0.215454 -1.336142
H  2.776694 0.31717 -1.923571
H  3.783166 -1.048167 -2.38019
H  5.08127 -1.48106 0.457935
H  3.884918 -2.654766 1.021091
H  4.508493 -2.743906 -0.625778
H  1.30756 1.861056 0.990071
H  1.200124 0.968239 -0.527847
H  -2.994488 -2.415624 -1.322721
H  -1.288426 -2.042642 -1.117436
H  -2.580954 3.11621 -0.980792
H  -3.55135 3.355294 0.471731
H  -1.934349 -4.068584 0.16216
H  -1.385131 -2.804811 1.26199
H  -3.114871 -3.146043 1.089272
H  -0.48413 3.262067 0.357417
H  -1.497526 4.663579 0.656229
H  -1.428043 3.373668 1.855293
elementType: S P O C H
totalener: -2042.19784689 hartree
nucrepener: 1716.01215434 hartree
electener: -3758.21000123 hartree
oneelecener: -6226.90320527 hartree
twoeener: 2468.69320404 hartree
cpcmener: -0.01657947 hartree
kineticenergy: 2036.95568074 hartree
xcener: -124.858103905974 hartree
chargesum: 0.0000000
charge: -0.170381 -0.162487 -0.452468 0.652075 -0.346643 -0.347670 0.200269 -0.313745 -0.320824 -0.293308 -0.118655 0.025774 0.038140 -0.232019 -0.253678 0.106090 0.102576 0.055599 0.096837 0.099422 0.099935 0.104680 0.105011 0.098097 0.165719 0.122891 0.113808 0.085141 0.094415 0.108150 0.094433 0.074000 0.094282 0.075646 0.103387 0.095501
qa: -0.1704 -0.1625 -0.4525 0.6521 -0.3466 -0.3477 0.2003 -0.3137 -0.3208 -0.2933 -0.1187 0.0258 0.0381 -0.2320 -0.2537 0.1061 0.1026 0.0556 0.0968 0.0994 0.0999 0.1047 0.1050 0.0981 0.1657 0.1229 0.1138 0.0851 0.0944 0.1081 0.0944 0.0740 0.0943 0.0756 0.1034 0.0955
va: 2.2406 2.3059 1.9902 5.4349 2.1052 2.1145 3.8738 3.9202 3.9531 3.8712 3.9838 3.8829 3.8588 3.9337 3.8906 1.0103 1.0094 1.0233 1.0137 1.0009 1.0029 1.0096 1.0116 1.0038 0.9914 1.0441 0.9993 0.9944 1.0122 0.9919 1.0072 1.0149 1.0056 1.0107 1.0114 1.0053
dispcorr: -0.018931687 hartree
energy: -2042.216778577263
dipole: 13.01383 -12.63197 0.38186 -8.28653 8.05532 -0.23121 -2.80936 2.67973 -0.12963
magnitude: 0.46484 au
magnitude: 1.18154 debye
