program: Orca
programVersion: 5.0.2
elementType: S S S P O O C C C C C C C C C H H H H H H H H H H H H H H H H H H H H H
charge: 0
multiplicity: 1
keywords: wb97x-d3
keywords: def2-TZVPP
keywords: def2/J RIJCOSX
keywords: DEFGRID2
keywords: scfconv7
keywords: smallprint printgap noloewdin
keywords: NOSOSCF
formula: C9H21O2PS3
InChI: InChI=1/C9H21O2PS3/c1-6-10-12(13,11-7-2)15-8-14-9(3,4)5/h6-8H2,1-5H3
36 atoms
S  2.041584 0.083908 -0.934848
S  -0.109396 -1.50388 0.647158
S  -1.693876 0.31165 -1.768375
P  -1.394705 0.044211 0.118955
O  -2.69295 -0.301222 0.996534
O  -0.785816 1.272542 0.938097
C  3.494344 -0.117252 0.184563
C  4.423257 -1.200066 -0.348746
C  4.185031 1.243849 0.131936
C  3.06346 -0.429099 1.611002
C  1.095879 -1.427825 -0.731675
C  -3.852206 -0.964823 0.46131
C  -1.322922 2.60407 0.77923
C  -3.626143 -2.433444 0.19676
C  -0.373601 3.463193 -0.01625
H  3.941971 -2.180015 -0.374515
H  4.77134 -0.970088 -1.356623
H  5.300087 -1.291217 0.297814
H  3.546464 2.036728 0.525287
H  4.478177 1.514907 -0.884593
H  5.093237 1.2169 0.738208
H  2.612263 -1.417981 1.698734
H  3.939341 -0.416692 2.265131
H  2.348718 0.302502 1.988473
H  0.55038 -1.593864 -1.660364
H  1.74575 -2.291741 -0.582875
H  -4.623378 -0.823419 1.21781
H  -4.175546 -0.450981 -0.446125
H  -2.307712 2.575042 0.306912
H  -1.455976 2.992908 1.788575
H  -2.91206 -2.600522 -0.610012
H  -3.276377 -2.956603 1.087005
H  -4.573167 -2.884159 -0.103898
H  -0.266334 3.097206 -1.03703
H  -0.760938 4.4818 -0.059841
H  0.613736 3.499336 0.445458
elementType: S P O C H
totalener: -2042.19855477 hartree
nucrepener: 1726.56309027 hartree
electener: -3768.76164504 hartree
oneelecener: -6249.07615679 hartree
twoeener: 2480.31451176 hartree
cpcmener: -0.01736890 hartree
kineticenergy: 2036.94735635 hartree
xcener: -124.854392971824 hartree
chargesum: 0.0000000
charge: -0.169947 -0.155201 -0.464068 0.667616 -0.366319 -0.339725 0.191609 -0.321727 -0.291368 -0.320676 -0.138468 0.036864 0.044753 -0.247449 -0.246022 0.100095 0.096173 0.098784 0.104967 0.104166 0.097537 0.089112 0.103776 0.097009 0.157507 0.151422 0.106608 0.092890 0.087118 0.105456 0.075382 0.090384 0.101224 0.077337 0.098300 0.084881
qa: -0.1699 -0.1552 -0.4641 0.6676 -0.3663 -0.3397 0.1916 -0.3217 -0.2914 -0.3207 -0.1385 0.0369 0.0448 -0.2474 -0.2460 0.1001 0.0962 0.0988 0.1050 0.1042 0.0975 0.0891 0.1038 0.0970 0.1575 0.1514 0.1066 0.0929 0.0871 0.1055 0.0754 0.0904 0.1012 0.0773 0.0983 0.0849
va: 2.2486 2.2887 1.9700 5.3903 2.0927 2.0924 3.8683 3.9377 3.8731 3.9246 3.9909 3.8671 3.8608 3.8954 3.9358 1.0038 1.0139 1.0031 1.0094 1.0093 1.0044 1.0023 1.0071 1.0183 1.0191 1.0054 0.9914 1.0127 1.0083 0.9959 1.0190 1.0044 1.0111 1.0159 1.0113 1.0040
dispcorr: -0.017869506 hartree
energy: -2042.216424271328
dipole: 14.31578 -14.04519 0.27059 2.24665 -2.55153 -0.30487 4.82012 -3.84234 0.97779
magnitude: 1.05935 au
magnitude: 2.69267 debye
