program: Orca
programVersion: 5.0.2
elementType: S S S P O O C C C C C C C C C H H H H H H H H H H H H H H H H H H H H H
charge: 0
multiplicity: 1
keywords: wb97x-d3
keywords: def2-TZVPP
keywords: def2/J RIJCOSX
keywords: DEFGRID2
keywords: scfconv7
keywords: smallprint printgap noloewdin
keywords: NOSOSCF
formula: C9H21O2PS3
InChI: InChI=1/C9H21O2PS3/c1-6-10-12(13,11-7-2)15-8-14-9(3,4)5/h6-8H2,1-5H3
36 atoms
S  1.802052 -1.213745 0.604754
S  0.093522 0.997758 1.618591
S  -0.779597 0.984864 -1.694172
P  -1.259702 0.496456 0.108222
O  -1.530421 -1.050138 0.392429
O  -2.589122 1.162347 0.705654
C  3.266763 -1.384706 -0.498868
C  4.496866 -0.7691 0.150402
C  3.440973 -2.892321 -0.646193
C  2.99565 -0.758353 -1.858927
C  1.662318 0.576355 0.811499
C  -1.930868 -1.972208 -0.637505
C  -3.114697 2.423074 0.249078
C  -3.377255 -1.801323 -1.028911
C  -2.294407 3.606002 0.699575
H  4.687037 -1.196022 1.13475
H  5.377206 -0.952918 -0.470698
H  4.403567 0.311433 0.262007
H  2.569969 -3.356919 -1.111169
H  3.614103 -3.379543 0.314374
H  4.303715 -3.099751 -1.282803
H  2.862715 0.321403 -1.801033
H  3.844295 -0.940508 -2.522881
H  2.107571 -1.182885 -2.324775
H  2.43304 0.972106 1.474282
H  1.719457 1.102488 -0.141451
H  -1.270854 -1.86259 -1.49997
H  -1.757284 -2.95804 -0.208824
H  -3.206807 2.402704 -0.838544
H  -4.1190 2.467878 0.667801
H  -3.561472 -0.837943 -1.505393
H  -3.646778 -2.577936 -1.745556
H  -4.039581 -1.897924 -0.168512
H  -1.306549 3.62095 0.239046
H  -2.809268 4.520591 0.402098
H  -2.176664 3.627732 1.782993
elementType: S P O C H
totalener: -2042.19823070 hartree
nucrepener: 1722.49812641 hartree
electener: -3764.69635711 hartree
oneelecener: -6240.79548813 hartree
twoeener: 2476.09913102 hartree
cpcmener: -0.01642738 hartree
kineticenergy: 2036.98400142 hartree
xcener: -124.863613062104 hartree
chargesum: 0.0000000
charge: -0.175173 -0.144071 -0.451813 0.649605 -0.338932 -0.362726 0.186374 -0.320765 -0.289403 -0.318131 -0.127023 0.038258 0.044174 -0.239805 -0.250939 0.098190 0.099060 0.097111 0.104226 0.103713 0.096461 0.094869 0.102317 0.092646 0.153279 0.128828 0.086370 0.108960 0.091633 0.108578 0.077056 0.096275 0.090961 0.077000 0.101167 0.091670
qa: -0.1752 -0.1441 -0.4518 0.6496 -0.3389 -0.3627 0.1864 -0.3208 -0.2894 -0.3181 -0.1270 0.0383 0.0442 -0.2398 -0.2509 0.0982 0.0991 0.0971 0.1042 0.1037 0.0965 0.0949 0.1023 0.0926 0.1533 0.1288 0.0864 0.1090 0.0916 0.1086 0.0771 0.0963 0.0910 0.0770 0.1012 0.0917
va: 2.2186 2.3084 1.9844 5.4058 2.0950 2.0840 3.8760 3.9230 3.8634 3.9415 4.0061 3.8540 3.8494 3.9301 3.9040 1.0135 1.0042 1.0005 1.0105 1.0115 1.0048 1.0050 1.0071 1.0150 0.9963 1.0241 1.0163 0.9909 1.0124 0.9914 1.0163 1.0085 1.0059 1.0190 1.0111 1.0037
dispcorr: -0.017760447 hartree
energy: -2042.215991146906
dipole: 10.26123 -9.92787 0.33336 -5.13419 5.26948 0.13529 -8.55795 8.16658 -0.39137
magnitude: 0.53160 au
magnitude: 1.35122 debye
