program: Orca
programVersion: 5.0.2
elementType: S S S P O O C C C C C C C C C H H H H H H H H H H H H H H H H H H H H H
charge: 0
multiplicity: 1
keywords: wb97x-d3
keywords: def2-TZVPP
keywords: def2/J RIJCOSX
keywords: DEFGRID2
keywords: scfconv7
keywords: smallprint printgap noloewdin
keywords: NOSOSCF
formula: C9H21O2PS3
InChI: InChI=1/C9H21O2PS3/c1-6-10-12(13,11-7-2)15-8-14-9(3,4)5/h6-8H2,1-5H3
36 atoms
S  1.793351 -1.195737 0.612555
S  0.091496 1.026382 1.620134
S  -0.774615 0.957506 -1.690153
P  -1.2610 0.495713 0.117487
O  -1.536885 -1.043234 0.430331
O  -2.593235 1.171495 0.6955
C  3.251282 -1.374398 -0.501187
C  4.499839 -0.811755 0.162847
C  3.383453 -2.883108 -0.691149
C  2.998755 -0.703097 -1.844369
C  1.659906 0.596351 0.816334
C  -1.907098 -1.992864 -0.583798
C  -3.111101 2.427174 0.220902
C  -3.349391 -1.846859 -1.003097
C  -2.294327 3.613355 0.670651
H  5.372676 -0.986629 -0.471416
H  4.427871 0.265749 0.321471
H  4.687205 -1.283868 1.127999
H  2.503076 -3.307632 -1.177212
H  3.532273 -3.402506 0.257342
H  4.246556 -3.098665 -1.324267
H  2.919544 0.381369 -1.758931
H  3.832704 -0.908988 -2.520406
H  2.08603 -1.072404 -2.312001
H  2.432032 0.990905 1.477876
H  1.718461 1.1195 -0.137846
H  -1.23509 -1.895549 -1.438695
H  -1.728864 -2.966953 -0.130198
H  -3.189055 2.397479 -0.867938
H  -4.121297 2.478196 0.625037
H  -3.533458 -0.896062 -1.50501
H  -3.599279 -2.642815 -1.705726
H  -4.025184 -1.928097 -0.151423
H  -1.299969 3.619953 0.223855
H  -2.801668 4.526663 0.356958
H  -2.191018 3.644923 1.75537
elementType: S P O C H
totalener: -2042.19797261 hartree
nucrepener: 1723.86261274 hartree
electener: -3766.06058535 hartree
oneelecener: -6243.51645629 hartree
twoeener: 2477.45587094 hartree
cpcmener: -0.01626493 hartree
kineticenergy: 2036.96892795 hartree
xcener: -124.860946608724 hartree
chargesum: -0.0000000
charge: -0.174909 -0.144855 -0.452240 0.651215 -0.339181 -0.362422 0.186486 -0.319364 -0.290807 -0.319048 -0.127657 0.040076 0.043644 -0.240470 -0.250883 0.099038 0.097170 0.097141 0.104863 0.103539 0.096610 0.094417 0.102893 0.093888 0.153838 0.129268 0.085660 0.108732 0.091295 0.108254 0.077023 0.096279 0.090973 0.076805 0.101103 0.091628
qa: -0.1749 -0.1449 -0.4522 0.6512 -0.3392 -0.3624 0.1865 -0.3194 -0.2908 -0.3190 -0.1277 0.0401 0.0436 -0.2405 -0.2509 0.0990 0.0972 0.0971 0.1049 0.1035 0.0966 0.0944 0.1029 0.0939 0.1538 0.1293 0.0857 0.1087 0.0913 0.1083 0.0770 0.0963 0.0910 0.0768 0.1011 0.0916
va: 2.2179 2.3064 1.9835 5.4051 2.0947 2.0856 3.8745 3.9242 3.8651 3.9399 4.0035 3.8522 3.8514 3.9313 3.9027 1.0040 1.0010 1.0135 1.0101 1.0110 1.0048 1.0045 1.0068 1.0155 0.9961 1.0247 1.0167 0.9909 1.0127 0.9914 1.0166 1.0084 1.0059 1.0189 1.0112 1.0036
dispcorr: -0.017798524 hartree
energy: -2042.215771130333
dipole: 10.30341 -9.94826 0.35515 -5.24803 5.36699 0.11896 -8.65654 8.25763 -0.39891
magnitude: 0.54719 au
magnitude: 1.39084 debye
