program: Orca
programVersion: 5.0.2
elementType: S S S P O O C C C C C C C C C H H H H H H H H H H H H H H H H H H H H H
charge: 0
multiplicity: 1
keywords: wb97x-d3
keywords: def2-TZVPP
keywords: def2/J RIJCOSX
keywords: DEFGRID2
keywords: scfconv7
keywords: smallprint printgap noloewdin
keywords: NOSOSCF
formula: C9H21O2PS3
InChI: InChI=1/C9H21O2PS3/c1-6-10-12(13,11-7-2)15-8-14-9(3,4)5/h6-8H2,1-5H3
36 atoms
S  2.165226 0.161919 -0.890355
S  0.115752 -1.611555 0.617707
S  -1.619877 -0.121855 -1.931349
P  -1.419644 -0.342239 -0.025359
O  -2.594884 -1.074792 0.769742
O  -1.279046 1.019223 0.807976
C  3.630285 0.032185 0.224918
C  4.261899 1.420017 0.156847
C  3.218953 -0.28629 1.654433
C  4.604734 -1.011775 -0.302361
C  1.326122 -1.418871 -0.73529
C  -3.987431 -0.890198 0.446887
C  -0.693705 2.225329 0.284497
C  -4.519042 0.468339 0.834478
C  -1.759822 3.255996 0.011102
H  5.170534 1.437411 0.762267
H  4.542434 1.691377 -0.862809
H  3.591624 2.189897 0.542488
H  2.799258 -1.288116 1.750012
H  2.485201 0.424827 2.034179
H  4.097593 -0.242815 2.303446
H  4.175794 -2.015206 -0.304983
H  4.930088 -0.780917 -1.316957
H  5.491587 -1.046962 0.335571
H  0.814174 -1.608218 -1.678276
H  2.037063 -2.23281 -0.589752
H  -4.137971 -1.079874 -0.618091
H  -4.500589 -1.675148 1.000146
H  0.008381 2.573882 1.042039
H  -0.121453 2.015283 -0.619248
H  -5.601423 0.469713 0.698964
H  -4.315024 0.69817 1.880378
H  -4.113047 1.266448 0.213511
H  -2.428857 2.934847 -0.787315
H  -2.351993 3.472842 0.900586
H  -1.284058 4.185085 -0.30636
elementType: S P O C H
totalener: -2042.19759882 hartree
nucrepener: 1713.70156675 hartree
electener: -3755.89916557 hartree
oneelecener: -6223.00558271 hartree
twoeener: 2467.10641714 hartree
cpcmener: -0.01653553 hartree
kineticenergy: 2036.95712770 hartree
xcener: -124.857587175868 hartree
chargesum: -0.0000000
charge: -0.176164 -0.155457 -0.454853 0.637741 -0.350964 -0.336633 0.193970 -0.292480 -0.322533 -0.321486 -0.151289 0.029164 0.062421 -0.244716 -0.264421 0.098340 0.104633 0.104611 0.090169 0.100565 0.104118 0.101169 0.097203 0.099371 0.159979 0.155371 0.092130 0.106448 0.102755 0.080582 0.100836 0.091995 0.080330 0.079673 0.094778 0.102644
qa: -0.1762 -0.1555 -0.4549 0.6377 -0.3510 -0.3366 0.1940 -0.2925 -0.3225 -0.3215 -0.1513 0.0292 0.0624 -0.2447 -0.2644 0.0983 0.1046 0.1046 0.0902 0.1006 0.1041 0.1012 0.0972 0.0994 0.1600 0.1554 0.0921 0.1064 0.1028 0.0806 0.1008 0.0920 0.0803 0.0797 0.0948 0.1026
va: 2.2389 2.2963 1.9804 5.4130 2.1189 2.0677 3.8617 3.8712 3.9340 3.9329 3.9949 3.8789 3.8250 3.8998 3.9473 1.0044 1.0097 1.0100 1.0014 1.0109 1.0062 1.0041 1.0138 1.0031 1.0215 1.0032 1.0071 0.9897 0.9949 1.0151 1.0103 1.0064 1.0053 1.0092 1.0015 1.0109
dispcorr: -0.018080447 hartree
energy: -2042.215679263981
dipole: 11.80456 -11.12694 0.67762 11.34888 -10.94366 0.40522 6.66978 -5.74649 0.92328
magnitude: 1.21483 au
magnitude: 3.08786 debye
