program: Orca
programVersion: 5.0.2
elementType: S S S P O O C C C C C C C C C H H H H H H H H H H H H H H H H H H H H H
charge: 0
multiplicity: 1
keywords: wb97x-d3
keywords: def2-TZVPP
keywords: def2/J RIJCOSX
keywords: DEFGRID2
keywords: scfconv7
keywords: smallprint printgap noloewdin
keywords: NOSOSCF
formula: C9H21O2PS3
InChI: InChI=1/C9H21O2PS3/c1-6-10-12(13,11-7-2)15-8-14-9(3,4)5/h6-8H2,1-5H3
36 atoms
S  2.105858 -0.150306 -1.075132
S  -0.131635 -1.497338 0.628062
S  -1.824364 0.197401 -1.808512
P  -1.359069 0.085682 0.060431
O  -2.583563 -0.089988 1.079683
O  -0.607488 1.341506 0.697778
C  3.34978 -0.178044 0.29172
C  4.495978 0.676879 -0.244027
C  2.783208 0.455953 1.556783
C  3.8353 -1.59262 0.566167
C  1.027369 -1.5530 -0.786912
C  -3.822818 -0.727958 0.725589
C  -1.072321 2.685297 0.439854
C  -3.701365 -2.228505 0.616765
C  -0.140033 3.394887 -0.509721
H  5.274493 0.76257 0.517233
H  4.946786 0.240457 -1.136215
H  4.168517 1.689449 -0.489604
H  1.940155 -0.108125 1.953148
H  2.450957 1.478952 1.377666
H  3.554787 0.487126 2.330851
H  4.192779 -2.084206 -0.339428
H  4.663838 -1.559962 1.277864
H  3.060767 -2.217745 1.013069
H  0.440124 -1.669734 -1.698943
H  1.588724 -2.47706 -0.649946
H  -4.512197 -0.452758 1.522865
H  -4.199839 -0.298491 -0.20506
H  -2.091639 2.677411 0.046338
H  -1.10062 3.181662 1.410093
H  -3.077985 -2.529394 -0.22544
H  -3.293492 -2.66761 1.527691
H  -4.694947 -2.650108 0.458135
H  0.878835 3.425692 -0.122497
H  -0.125855 2.914402 -1.487788
H  -0.478704 4.423245 -0.642301
elementType: S P O C H
totalener: -2042.19805881 hartree
nucrepener: 1735.47477793 hartree
electener: -3777.67283673 hartree
oneelecener: -6266.81972372 hartree
twoeener: 2489.14688699 hartree
cpcmener: -0.01635735 hartree
kineticenergy: 2036.95984950 hartree
xcener: -124.857543111982 hartree
chargesum: -0.0000000
charge: -0.163478 -0.157022 -0.461191 0.660149 -0.362857 -0.331907 0.188958 -0.288644 -0.334062 -0.325902 -0.142990 0.038456 0.040267 -0.247815 -0.246507 0.095973 0.101521 0.103711 0.095552 0.093101 0.104755 0.104945 0.103019 0.091702 0.160189 0.154967 0.106433 0.092631 0.088884 0.106491 0.075996 0.090421 0.101385 0.085367 0.077360 0.100143
qa: -0.1635 -0.1570 -0.4612 0.6601 -0.3629 -0.3319 0.1890 -0.2886 -0.3341 -0.3259 -0.1430 0.0385 0.0403 -0.2478 -0.2465 0.0960 0.1015 0.1037 0.0956 0.0931 0.1048 0.1049 0.1030 0.0917 0.1602 0.1550 0.1064 0.0926 0.0889 0.1065 0.0760 0.0904 0.1014 0.0854 0.0774 0.1001
va: 2.2539 2.2914 1.9756 5.4019 2.0957 2.0979 3.8691 3.8756 3.9299 3.9256 4.0020 3.8643 3.8544 3.8939 3.9390 1.0050 1.0144 1.0084 1.0239 1.0094 1.0075 1.0098 1.0044 0.9995 1.0173 0.9952 0.9914 1.0127 1.0088 0.9963 1.0188 1.0041 1.0113 1.0030 1.0163 1.0114
dispcorr: -0.018600465 hartree
energy: -2042.216659274980
dipole: 13.48678 -13.28587 0.20091 3.04294 -3.18212 -0.13918 6.31211 -5.18880 1.12332
magnitude: 1.14960 au
magnitude: 2.92205 debye
