program: Orca
programVersion: 5.0.2
elementType: S S S P O O C C C C C C C C C H H H H H H H H H H H H H H H H H H H H H
charge: 0
multiplicity: 1
keywords: wb97x-d3
keywords: def2-TZVPP
keywords: def2/J RIJCOSX
keywords: DEFGRID2
keywords: scfconv7
keywords: smallprint printgap noloewdin
keywords: NOSOSCF
formula: C9H21O2PS3
InChI: InChI=1/C9H21O2PS3/c1-6-10-12(13,11-7-2)15-8-14-9(3,4)5/h6-8H2,1-5H3
36 atoms
S  2.171525 0.165474 -0.892808
S  0.119713 -1.587059 0.635442
S  -1.620016 -0.120225 -1.919982
P  -1.426546 -0.33321 -0.0124
O  -2.597815 -1.072898 0.781709
O  -1.302945 1.030714 0.81977
C  3.641084 0.027865 0.215262
C  4.27455 1.414955 0.152089
C  3.236552 -0.297833 1.64511
C  4.610986 -1.015127 -0.322584
C  1.323324 -1.408715 -0.72552
C  -3.99055 -0.903346 0.449789
C  -0.70063 2.232047 0.3034
C  -4.532384 0.459123 0.807767
C  -1.756762 3.259159 -0.016637
H  3.607575 2.183392 0.546184
H  5.186474 1.427201 0.752651
H  4.550071 1.692317 -0.867289
H  2.817885 -1.300344 1.737911
H  2.504501 0.411115 2.032027
H  4.118294 -0.257479 2.290096
H  4.177835 -2.016716 -0.333391
H  4.935363 -0.7769 -1.335794
H  5.498829 -1.059289 0.31332
H  0.804675 -1.599773 -1.664516
H  2.02963 -2.226746 -0.57996
H  -4.134922 -1.115159 -0.611833
H  -4.500513 -1.68076 1.016425
H  -0.025562 2.588653 1.081519
H  -0.096609 2.012842 -0.577388
H  -5.613896 0.451067 0.665854
H  -4.336111 0.710744 1.850117
H  -4.127574 1.247404 0.173467
H  -1.270584 4.184619 -0.328962
H  -2.399548 2.929239 -0.832848
H  -2.377629 3.486362 0.850426
elementType: S P O C H
totalener: -2042.19752838 hartree
nucrepener: 1712.95451421 hartree
electener: -3755.15204259 hartree
oneelecener: -6221.51426938 hartree
twoeener: 2466.36222679 hartree
cpcmener: -0.01651110 hartree
kineticenergy: 2036.95804629 hartree
xcener: -124.857618950369 hartree
chargesum: -0.0000000
charge: -0.175928 -0.155604 -0.454365 0.637252 -0.351134 -0.336548 0.194371 -0.292395 -0.322800 -0.321245 -0.151249 0.028659 0.060775 -0.244132 -0.263632 0.104609 0.098243 0.104614 0.089935 0.100620 0.104251 0.101065 0.096982 0.099375 0.159739 0.155342 0.092476 0.106735 0.103902 0.080729 0.100838 0.091920 0.080124 0.102450 0.079436 0.094591
qa: -0.1759 -0.1556 -0.4544 0.6373 -0.3511 -0.3365 0.1944 -0.2924 -0.3228 -0.3212 -0.1512 0.0287 0.0608 -0.2441 -0.2636 0.1046 0.0982 0.1046 0.0899 0.1006 0.1043 0.1011 0.0970 0.0994 0.1597 0.1553 0.0925 0.1067 0.1039 0.0807 0.1008 0.0919 0.0801 0.1024 0.0794 0.0946
va: 2.2391 2.2973 1.9808 5.4130 2.1188 2.0677 3.8606 3.8714 3.9344 3.9337 3.9956 3.8786 3.8250 3.8987 3.9462 1.0101 1.0044 1.0096 1.0009 1.0111 1.0063 1.0042 1.0138 1.0031 1.0219 1.0033 1.0070 0.9897 0.9950 1.0161 1.0103 1.0066 1.0060 1.0110 1.0099 1.0016
dispcorr: -0.018052941 hartree
energy: -2042.215581318391
dipole: 11.86323 -11.18691 0.67632 11.18150 -10.79177 0.38972 6.42753 -5.51254 0.91499
magnitude: 1.20270 au
magnitude: 3.05703 debye
