program: Orca
programVersion: 5.0.2
elementType: S S S P O O C C C C C C C C C H H H H H H H H H H H H H H H H H H H H H
charge: 0
multiplicity: 1
keywords: wb97x-d3
keywords: def2-TZVPP
keywords: def2/J RIJCOSX
keywords: DEFGRID2
keywords: scfconv7
keywords: smallprint printgap noloewdin
keywords: NOSOSCF
formula: C9H21O2PS3
InChI: InChI=1/C9H21O2PS3/c1-6-10-12(13,11-7-2)15-8-14-9(3,4)5/h6-8H2,1-5H3
36 atoms
S  2.192947 0.394238 -1.048822
S  0.248377 -1.801754 -0.02048
S  -1.846435 0.055105 -1.960492
P  -1.283928 -0.393219 -0.17053
O  -2.306108 -1.194409 0.761282
O  -0.886182 0.846611 0.758315
C  3.328561 0.167346 0.392486
C  3.991078 -1.201161 0.365456
C  4.37787 1.261135 0.205359
C  2.583925 0.386658 1.70434
C  1.396407 -1.193923 -1.298445
C  -3.734848 -1.078394 0.623669
C  -0.62905 2.188815 0.308203
C  -4.263354 0.271726 1.043035
C  -1.513341 3.151217 1.061717
H  4.478917 -1.400136 -0.589736
H  4.755935 -1.247512 1.144228
H  3.287045 -2.009622 0.567357
H  3.927529 2.255418 0.160027
H  4.961362 1.112268 -0.704297
H  5.067887 1.256567 1.052058
H  1.79543 -0.349196 1.855298
H  3.281426 0.304427 2.542323
H  2.132669 1.379021 1.745891
H  0.84877 -1.109015 -2.23862
H  2.123427 -1.99503 -1.427027
H  -4.016656 -1.306503 -0.406074
H  -4.135006 -1.865078 1.260281
H  0.425233 2.394559 0.489652
H  -0.799225 2.264331 -0.766719
H  -5.353459 0.240624 1.032041
H  -3.947031 0.532896 2.05315
H  -3.953871 1.063188 0.36029
H  -1.270729 4.170207 0.757528
H  -2.569283 2.981811 0.84772
H  -1.360843 3.081894 2.139651
elementType: S P O C H
totalener: -2042.19637384 hartree
nucrepener: 1736.18100661 hartree
electener: -3778.37738045 hartree
oneelecener: -6267.83595131 hartree
twoeener: 2489.45857085 hartree
cpcmener: -0.01576973 hartree
kineticenergy: 2036.97104855 hartree
xcener: -124.862575519973 hartree
chargesum: 0.0000000
charge: -0.170365 -0.159219 -0.457079 0.650839 -0.351928 -0.335766 0.193567 -0.326805 -0.292425 -0.346172 -0.151447 0.036644 0.058430 -0.246135 -0.247579 0.105497 0.104303 0.093700 0.103475 0.100908 0.096879 0.097682 0.107883 0.101923 0.161787 0.151155 0.093832 0.106788 0.085004 0.094676 0.101232 0.094104 0.071607 0.096192 0.086314 0.090500
qa: -0.1704 -0.1592 -0.4571 0.6508 -0.3519 -0.3358 0.1936 -0.3268 -0.2924 -0.3462 -0.1514 0.0366 0.0584 -0.2461 -0.2476 0.1055 0.1043 0.0937 0.1035 0.1009 0.0969 0.0977 0.1079 0.1019 0.1618 0.1512 0.0938 0.1068 0.0850 0.0947 0.1012 0.0941 0.0716 0.0962 0.0863 0.0905
va: 2.2416 2.3014 1.9798 5.4071 2.1058 2.0727 3.8436 3.9269 3.8876 3.9262 4.0105 3.8649 3.8063 3.8919 3.9610 1.0077 1.0045 1.0006 1.0075 1.0147 1.0047 1.0259 1.0074 1.0024 1.0154 0.9962 1.0083 0.9910 0.9967 1.0195 1.0108 1.0040 1.0160 1.0080 1.0024 1.0041
dispcorr: -0.019122867 hartree
energy: -2042.215496710726
dipole: 9.87161 -9.37000 0.50161 11.52870 -11.14143 0.38727 12.26268 -11.15187 1.11081
magnitude: 1.27887 au
magnitude: 3.25062 debye
