program: Orca
programVersion: 5.0.2
elementType: S S S P O O C C C C C C C C C H H H H H H H H H H H H H H H H H H H H H
charge: 0
multiplicity: 1
keywords: wb97x-d3
keywords: def2-TZVPP
keywords: def2/J RIJCOSX
keywords: DEFGRID2
keywords: scfconv7
keywords: smallprint printgap noloewdin
keywords: NOSOSCF
formula: C9H21O2PS3
InChI: InChI=1/C9H21O2PS3/c1-6-10-12(13,11-7-2)15-8-14-9(3,4)5/h6-8H2,1-5H3
36 atoms
S  1.686521 -1.31593 -0.782223
S  0.70526 1.492909 0.103991
S  -1.788458 0.096632 -1.753475
P  -1.197032 0.667004 -0.008083
O  -1.151046 -0.445811 1.137082
O  -2.070681 1.811654 0.699083
C  3.092084 -1.518909 0.392996
C  4.406598 -1.164014 -0.287466
C  2.895594 -0.691006 1.654478
C  3.060961 -3.005584 0.737611
C  1.602219 0.446002 -1.101923
C  -2.278933 -1.324152 1.349367
C  -2.880303 2.751293 -0.031147
C  -1.928227 -2.733436 0.947981
C  -2.065916 3.81176 -0.729281
H  5.238759 -1.32316 0.40313
H  4.579774 -1.780004 -1.170288
H  4.441872 -0.116904 -0.593002
H  2.971214 0.379184 1.462425
H  3.674248 -0.944782 2.378544
H  1.927466 -0.881654 2.118133
H  3.88814 -3.241033 1.410497
H  2.134388 -3.284363 1.242433
H  3.168693 -3.63463 -0.148008
H  2.59483 0.891686 -1.17624
H  1.121653 0.568069 -2.072243
H  -2.512644 -1.263364 2.412478
H  -3.156859 -0.974054 0.800969
H  -3.509699 2.211967 -0.741974
H  -3.532254 3.195644 0.719949
H  -1.050196 -3.095278 1.483858
H  -2.762334 -3.393379 1.19026
H  -1.739584 -2.809867 -0.122538
H  -1.456953 3.397059 -1.532943
H  -2.745725 4.540009 -1.174002
H  -1.414427 4.343562 -0.035704
elementType: S P O C H
totalener: -2042.19828423 hartree
nucrepener: 1729.59498320 hartree
electener: -3771.79326743 hartree
oneelecener: -6255.12645065 hartree
twoeener: 2483.33318323 hartree
cpcmener: -0.01717454 hartree
kineticenergy: 2036.97133628 hartree
xcener: -124.858865904070 hartree
chargesum: 0.0000000
charge: -0.166567 -0.153943 -0.463880 0.663398 -0.336799 -0.366492 0.190549 -0.322398 -0.323391 -0.291999 -0.142036 0.044403 0.038382 -0.244630 -0.247748 0.098750 0.096933 0.100246 0.091296 0.103365 0.096691 0.097660 0.105237 0.103826 0.152239 0.158260 0.105274 0.086228 0.092864 0.107237 0.085431 0.098040 0.076587 0.075870 0.100714 0.090401
qa: -0.1666 -0.1539 -0.4639 0.6634 -0.3368 -0.3665 0.1905 -0.3224 -0.3234 -0.2920 -0.1420 0.0444 0.0384 -0.2446 -0.2477 0.0987 0.0969 0.1002 0.0913 0.1034 0.0967 0.0977 0.1052 0.1038 0.1522 0.1583 0.1053 0.0862 0.0929 0.1072 0.0854 0.0980 0.0766 0.0759 0.1007 0.0904
va: 2.2485 2.2903 1.9700 5.3961 2.0932 2.0906 3.8716 3.9342 3.9223 3.8703 3.9939 3.8591 3.8645 3.9421 3.8966 1.0031 1.0138 1.0039 1.0038 1.0070 1.0196 1.0046 1.0089 1.0102 1.0045 1.0184 0.9965 1.0093 1.0127 0.9915 1.0029 1.0113 1.0147 1.0198 1.0111 1.0045
dispcorr: -0.018040563 hartree
energy: -2042.216324789638
dipole: 11.24799 -10.83286 0.41513 -7.53732 7.89784 0.36052 6.97224 -6.03285 0.93939
magnitude: 1.08846 au
magnitude: 2.76666 debye
