program: Orca
programVersion: 5.0.2
elementType: S S S P O O C C C C C C C C C H H H H H H H H H H H H H H H H H H H H H
charge: 0
multiplicity: 1
keywords: wb97x-d3
keywords: def2-TZVPP
keywords: def2/J RIJCOSX
keywords: DEFGRID2
keywords: scfconv7
keywords: smallprint printgap noloewdin
keywords: NOSOSCF
formula: C9H21O2PS3
InChI: InChI=1/C9H21O2PS3/c1-6-10-12(13,11-7-2)15-8-14-9(3,4)5/h6-8H2,1-5H3
36 atoms
S  2.770572 0.197892 1.087599
S  -0.242096 0.195256 1.118071
S  -0.814166 0.00628 -2.244561
P  -1.550029 0.38192 -0.503529
O  -2.773295 -0.526661 -0.01513
O  -2.175295 1.846861 -0.452203
C  3.120826 -1.184326 -0.085905
C  1.977304 -2.18762 -0.134051
C  3.419419 -0.64167 -1.476036
C  4.368582 -1.839499 0.499499
C  1.282036 0.967734 0.448131
C  -2.884408 -1.938188 -0.287687
C  -2.744505 2.428437 0.741516
C  -2.236815 -2.779686 0.783486
C  -1.960531 3.65299 1.134692
H  2.27345 -3.043692 -0.746238
H  1.722892 -2.55824 0.859121
H  1.07911 -1.76394 -0.583929
H  2.550176 -0.162664 -1.929257
H  3.708243 -1.462655 -2.13733
H  4.236518 0.080078 -1.460381
H  4.189675 -2.234387 1.500837
H  4.670761 -2.675056 -0.13529
H  5.209464 -1.145502 0.550926
H  1.300261 2.013268 0.751727
H  1.250895 0.93653 -0.641641
H  -3.955327 -2.131186 -0.337652
H  -2.459946 -2.154858 -1.270264
H  -3.77698 2.679881 0.498143
H  -2.768253 1.706926 1.560687
H  -2.458231 -3.829547 0.586286
H  -1.152728 -2.668398 0.797191
H  -2.625232 -2.538409 1.773331
H  -0.937149 3.400844 1.414711
H  -1.930791 4.386622 0.328724
H  -2.436548 4.123409 1.995888
elementType: S P O C H
totalener: -2042.19816446 hartree
nucrepener: 1711.84903888 hartree
electener: -3754.04720334 hartree
oneelecener: -6218.75243750 hartree
twoeener: 2464.70523417 hartree
cpcmener: -0.01650061 hartree
kineticenergy: 2036.95235560 hartree
xcener: -124.856862356510 hartree
chargesum: -0.0000000
charge: -0.166952 -0.174390 -0.444584 0.656357 -0.344353 -0.346582 0.187484 -0.298418 -0.321358 -0.288538 -0.110834 0.039487 0.029786 -0.235442 -0.226384 0.104532 0.099157 0.052246 0.096005 0.100203 0.099510 0.105234 0.097898 0.104298 0.160343 0.116802 0.106714 0.087725 0.106281 0.087756 0.098757 0.069198 0.094453 0.072728 0.091887 0.092994
qa: -0.1670 -0.1744 -0.4446 0.6564 -0.3444 -0.3466 0.1875 -0.2984 -0.3214 -0.2885 -0.1108 0.0395 0.0298 -0.2354 -0.2264 0.1045 0.0992 0.0522 0.0960 0.1002 0.0995 0.1052 0.0979 0.1043 0.1603 0.1168 0.1067 0.0877 0.1063 0.0878 0.0988 0.0692 0.0945 0.0727 0.0919 0.0930
va: 2.2383 2.2750 2.0019 5.4271 2.0949 2.1147 3.8870 3.8993 3.9418 3.8574 3.9821 3.8619 3.8844 3.9105 3.9331 1.0101 1.0128 1.0393 1.0044 1.0031 1.0147 1.0112 1.0041 1.0112 0.9960 1.0527 0.9902 1.0150 0.9963 1.0016 1.0119 1.0062 1.0043 1.0088 1.0041 1.0091
dispcorr: -0.018642646 hartree
energy: -2042.216807101656
dipole: 9.27790 -9.75653 -0.47863 -8.44754 8.04451 -0.40303 3.70306 -2.69507 1.00799
magnitude: 1.18641 au
magnitude: 3.01561 debye
