program: Orca
programVersion: 5.0.2
elementType: S S S P O O C C C C C C C C C H H H H H H H H H H H H H H H H H H H H H
charge: 0
multiplicity: 1
keywords: wb97x-d3
keywords: def2-TZVPP
keywords: def2/J RIJCOSX
keywords: DEFGRID2
keywords: scfconv7
keywords: smallprint printgap noloewdin
keywords: NOSOSCF
formula: C9H21O2PS3
InChI: InChI=1/C9H21O2PS3/c1-6-10-12(13,11-7-2)15-8-14-9(3,4)5/h6-8H2,1-5H3
36 atoms
S  2.758521 0.462919 0.735256
S  -0.218493 0.297745 0.971446
S  -1.220518 -0.502438 -2.186194
P  -1.72651 0.224478 -0.475758
O  -2.889756 -0.527729 0.326263
O  -2.325631 1.69347 -0.63031
C  3.208906 -1.139832 -0.066169
C  3.525602 -0.918379 -1.538744
C  4.464821 -1.580145 0.680208
C  2.105791 -2.173828 0.099235
C  1.194579 0.894872 -0.032426
C  -3.019419 -1.962008 0.385641
C  -2.706236 2.520076 0.491932
C  -2.340182 -2.540611 1.601658
C  -1.855156 3.762986 0.519452
H  3.824321 -1.863743 -1.999176
H  2.663115 -0.551421 -2.098077
H  4.342368 -0.20803 -1.671697
H  5.265441 -0.841788 0.60418
H  4.83719 -2.511619 0.248665
H  4.266892 -1.76103 1.737752
H  1.85711 -2.335202 1.148214
H  1.192922 -1.894134 -0.428437
H  2.439551 -3.127663 -0.317477
H  1.14199 1.980598 -0.103318
H  1.118824 0.486956 -1.041568
H  -4.091933 -2.149046 0.413864
H  -2.629052 -2.404808 -0.532988
H  -3.759594 2.763713 0.352065
H  -2.619499 1.974206 1.433594
H  -1.255861 -2.443097 1.552302
H  -2.692288 -2.070037 2.519977
H  -2.573679 -3.60439 1.662287
H  -0.804284 3.525764 0.690182
H  -1.938803 4.327589 -0.409484
H  -2.187352 4.408691 1.333355
elementType: S P O C H
totalener: -2042.19923577 hartree
nucrepener: 1701.23280337 hartree
electener: -3743.43203914 hartree
oneelecener: -6197.45621088 hartree
twoeener: 2454.02417174 hartree
cpcmener: -0.01706367 hartree
kineticenergy: 2036.94905806 hartree
xcener: -124.855036980234 hartree
chargesum: -0.0000000
charge: -0.171225 -0.177602 -0.446234 0.653207 -0.345021 -0.346059 0.186589 -0.320994 -0.288644 -0.302776 -0.103781 0.042799 0.030151 -0.236937 -0.228411 0.099862 0.101567 0.097356 0.104309 0.098043 0.104189 0.099355 0.062159 0.104592 0.163062 0.111468 0.106383 0.083463 0.107209 0.088277 0.072605 0.093557 0.097800 0.073600 0.092359 0.093720
qa: -0.1712 -0.1776 -0.4462 0.6532 -0.3450 -0.3461 0.1866 -0.3210 -0.2886 -0.3028 -0.1038 0.0428 0.0302 -0.2369 -0.2284 0.0999 0.1016 0.0974 0.1043 0.0980 0.1042 0.0994 0.0622 0.1046 0.1631 0.1115 0.1064 0.0835 0.1072 0.0883 0.0726 0.0936 0.0978 0.0736 0.0924 0.0937
va: 2.2329 2.2789 2.0074 5.4381 2.0951 2.1134 3.8811 3.9497 3.8631 3.9071 3.9785 3.8620 3.8799 3.9118 3.9357 1.0029 0.9998 1.0132 1.0100 1.0037 1.0120 1.0120 1.0315 1.0092 0.9946 1.0504 0.9903 1.0163 0.9961 1.0017 1.0100 1.0043 1.0112 1.0077 1.0037 1.0092
dispcorr: -0.018058934 hartree
energy: -2042.217294706263
dipole: 11.33099 -11.49938 -0.16839 -7.18574 6.94470 -0.24104 5.48193 -4.31706 1.16487
magnitude: 1.20141 au
magnitude: 3.05373 debye
