program: Orca
programVersion: 5.0.2
elementType: S S S P O O C C C C C C C C C H H H H H H H H H H H H H H H H H H H H H
charge: 0
multiplicity: 1
keywords: wb97x-d3
keywords: def2-TZVPP
keywords: def2/J RIJCOSX
keywords: DEFGRID2
keywords: scfconv7
keywords: smallprint printgap noloewdin
keywords: NOSOSCF
formula: C9H21O2PS3
InChI: InChI=1/C9H21O2PS3/c1-6-10-12(13,11-7-2)15-8-14-9(3,4)5/h6-8H2,1-5H3
36 atoms
S  3.150669 -0.246921 0.991746
S  0.194767 0.021318 1.372627
S  -0.831692 0.765281 -1.796609
P  -1.309054 0.625032 0.070585
O  -2.454621 -0.429723 0.448574
O  -1.873856 1.953859 0.750325
C  3.260244 -1.420497 -0.429979
C  1.961453 -2.186097 -0.636314
C  3.646092 -0.670431 -1.697658
C  4.376168 -2.376886 -0.021054
C  1.701586 0.743623 0.618922
C  -2.411799 -1.784636 -0.043772
C  -2.696416 2.901252 0.038142
C  -3.373725 -1.969358 -1.190031
C  -4.084124 2.380331 -0.244809
H  2.108547 -2.943082 -1.411204
H  1.639358 -2.694222 0.272473
H  1.149948 -1.53854 -0.971221
H  2.877707 0.041866 -2.003055
H  3.773563 -1.37577 -2.522918
H  4.582405 -0.125921 -1.573507
H  4.547344 -3.099849 -0.821315
H  5.318716 -1.855178 0.156412
H  4.1213 -2.935195 0.88109
H  1.85653 1.736256 1.038251
H  1.551736 0.852104 -0.455953
H  -1.394647 -2.05526 -0.339986
H  -2.682048 -2.415057 0.803265
H  -2.735271 3.772622 0.690177
H  -2.190801 3.195601 -0.884048
H  -4.394991 -1.720576 -0.899616
H  -3.094611 -1.359147 -2.04875
H  -3.360553 -3.014465 -1.502223
H  -4.080217 1.56432 -0.968357
H  -4.580051 2.040536 0.664547
H  -4.682161 3.188629 -0.667848
elementType: S P O C H
totalener: -2042.19911870 hartree
nucrepener: 1698.57274215 hartree
electener: -3740.77186085 hartree
oneelecener: -6192.33900311 hartree
twoeener: 2451.56714226 hartree
cpcmener: -0.01510388 hartree
kineticenergy: 2036.96350650 hartree
xcener: -124.857377520005 hartree
chargesum: 0.0000000
charge: -0.168218 -0.152696 -0.456258 0.654333 -0.348996 -0.351090 0.191214 -0.303545 -0.317898 -0.290591 -0.110175 0.050209 0.024143 -0.246333 -0.236084 0.105022 0.100576 0.050508 0.099240 0.099577 0.097162 0.097574 0.104885 0.104590 0.163921 0.111337 0.083484 0.109499 0.108769 0.092799 0.091831 0.078197 0.097668 0.075762 0.091358 0.098222
qa: -0.1682 -0.1527 -0.4563 0.6543 -0.3490 -0.3511 0.1912 -0.3035 -0.3179 -0.2906 -0.1102 0.0502 0.0241 -0.2463 -0.2361 0.1050 0.1006 0.0505 0.0992 0.0996 0.0972 0.0976 0.1049 0.1046 0.1639 0.1113 0.0835 0.1095 0.1088 0.0928 0.0918 0.0782 0.0977 0.0758 0.0914 0.0982
va: 2.2322 2.3130 1.9800 5.4176 2.0785 2.1166 3.8800 3.9104 3.9480 3.8666 3.9648 3.8737 3.8740 3.9316 3.8955 1.0104 1.0128 1.0324 1.0008 1.0033 1.0140 1.0039 1.0095 1.0121 1.0002 1.0546 0.9945 0.9946 0.9904 1.0118 1.0029 1.0188 1.0100 1.0139 1.0063 1.0096
dispcorr: -0.018089098 hartree
energy: -2042.217207799159
dipole: 1.36318 -1.93298 -0.56980 -10.47051 10.05086 -0.41965 -10.78179 10.26954 -0.51225
magnitude: 0.87360 au
magnitude: 2.22051 debye
