program: Gaussian 09
title: 000066843
version: EM64L-G09RevD.01
frameworkgroup: C1[X(C18H24O3)]
method: RPBEPBE
basis: SDD
operation: Freq
keyword: #pfreq=noraman
keyword: PBEPBE/SDD
title: #p freq=noraman PBEPBE/SDD
converged: YES YES NO NO
title: Mulliken charges:
elementType: O O O C C C C C C C C C C C C C C C C C C H H H H H H H H H H H H H H H H H H H H H H H H
charge: -0.455914 -0.438161 -0.437138 0.212270 0.387885 -0.124620 -0.184485 -0.207967 -0.550911 -0.585745 -0.490269 -0.470915 -0.493970 -0.866238 0.249401 -0.574632 0.300620 -0.341567 -0.533498 -0.446590 0.287035 0.226911 0.194771 0.267632 0.203656 0.234441 0.237221 0.229123 0.223182 0.200217 0.200589 0.237685 0.223024 0.232793 0.234243 0.239328 0.230013 0.220576 0.230576 0.318145 0.328570 0.224458 0.256261 0.218978 0.353015
chargesum: 0.00000
title: Mulliken charges with hydrogens summed into heavy atoms:
elementType: O O O C C C C C C C C C C C C C C C C C C
charge: -0.137769 -0.109591 -0.084123 0.212270 0.387885 0.102291 0.010286 0.059665 -0.112814 -0.119400 -0.066869 -0.032641 -0.038153 -0.162654 0.249401 -0.123480 0.300620 -0.117109 -0.277237 -0.227612 0.287035
polarizability: 2.58189534e+02 -7.66613547e+00 1.90084072e+02 4.35229685e+00 7.71268980e+00 1.37381294e+02
1716.lowfreq: -13.2345 0.0004 0.0005 0.0010 8.3100 10.6202 36.0429 61.5268 104.8942
frequency: 36.0046 61.3892 104.8770 116.1547 123.0635 143.3163 200.0472 203.6272 217.5674 226.6892 242.0834 256.2937 271.3598 292.8747 298.9566 308.3818 338.1883 341.7414 348.6605 361.7112 376.4517 400.3675 414.9809 438.3416 445.0524 459.7095 468.4612 475.1526 495.4430 535.3869 557.7898 570.6869 604.5948 622.6215 668.2655 706.6336 715.6276 735.1161 759.2988 783.3177 810.0923 816.3074 837.8565 847.4628 871.9089 885.1902 903.3159 916.6259 923.6994 930.1830 949.2807 967.2126 988.1873 1001.9923 1009.1368 1015.1840 1032.1289 1040.6632 1045.4950 1067.3745 1090.2961 1104.7984 1109.0566 1129.5961 1134.3209 1147.5082 1154.4858 1178.1833 1183.5005 1185.5780 1197.6344 1215.3459 1219.9503 1229.3350 1243.8322 1250.5321 1254.4846 1260.6060 1269.2047 1277.8157 1283.7525 1289.0262 1302.7226 1306.3327 1317.7106 1321.1666 1329.3360 1339.0415 1346.5643 1366.0296 1369.0620 1383.2263 1393.2359 1441.4878 1454.9836 1456.7391 1468.3921 1470.9138 1473.9326 1480.7015 1492.2400 1494.7001 1501.2919 1586.2122 1631.0154 2875.6294 2957.2788 2961.7079 2977.9169 2983.2146 2987.2671 2988.0634 2991.9226 3015.7838 3020.3968 3031.0444 3043.5202 3051.5302 3064.5630 3065.7792 3079.0969 3094.1426 3097.6967 3113.3047 3142.2814 3151.4819 3552.3064 3556.5384 3583.3496
redmass: 4.5168 4.1883 4.3196 2.3017 5.0810 2.4544 3.0401 2.7341 4.5761 2.8524 1.6062 2.0357 1.2915 2.8384 3.5859 4.1729 1.8504 1.1411 1.6720 2.3119 2.5664 3.5584 3.1849 3.1903 3.3484 3.5035 3.0994 3.0029 3.4962 4.3514 2.9786 3.9293 2.5065 3.4265 3.5145 3.4578 4.6432 2.9464 2.2773 1.7720 2.0565 1.6783 2.4492 2.0416 2.4035 1.6210 2.2390 3.3202 1.5887 1.7225 1.8481 2.1374 2.2951 2.3901 2.3354 2.1414 2.0979 2.3122 1.8799 2.4203 1.9059 2.3322 2.3408 1.4724 1.5073 1.5709 1.4334 1.5114 1.7031 1.6411 2.2369 1.5142 1.5934 1.5396 1.4291 1.3598 2.3893 1.4570 1.5783 1.4287 1.6124 1.4110 1.4061 1.5204 1.5188 1.3975 1.5841 1.5307 1.6189 1.2468 1.5612 5.1803 1.2091 2.8897 1.0763 1.1808 1.0743 1.0952 1.0908 1.0842 1.0703 2.5932 1.0588 7.1598 6.4361 1.0796 1.0649 1.0659 1.0806 1.0414 1.0653 1.0598 1.0629 1.0649 1.0929 1.0938 1.1021 1.1026 1.0920 1.0984 1.0933 1.0978 1.0958 1.0890 1.0915 1.0937 1.0655 1.0648 1.0660
irintensity: 0.1813 0.8602 1.1188 0.6961 1.4736 6.9082 4.6157 1.1532 2.5616 2.7944 2.4861 36.0622 122.0275 12.1231 0.5793 3.3861 23.3333 143.2124 82.4036 34.1769 3.2286 7.4552 3.8835 0.8783 3.1017 0.1977 5.7949 10.0052 1.3167 5.5205 6.7725 2.5837 2.1484 7.0686 6.8080 1.8855 1.1903 1.3371 3.1877 25.0029 21.0594 3.2673 1.0586 13.0460 30.9549 19.5688 30.8231 32.7991 6.5717 5.1118 27.2415 15.2846 3.6034 91.3223 17.4528 11.0052 15.7795 19.7874 10.3455 33.7761 29.6521 4.5554 12.1758 15.1454 28.9764 72.9124 24.6673 47.0521 0.6255 24.3197 16.8167 5.4487 1.7980 16.0074 8.3199 16.0041 32.5054 14.7904 4.7751 26.7821 11.4180 5.3424 1.9529 4.4891 11.8052 6.7682 6.4125 3.4670 2.7151 30.9503 10.6833 14.7218 28.2796 6.7601 3.0152 6.3194 10.4075 17.9510 6.9826 10.3299 18.2112 89.2352 5.6903 30.8408 50.2339 32.1199 27.5086 32.8697 11.4927 14.1407 53.6740 27.0250 28.5080 23.5611 37.2465 27.1213 38.2469 47.7108 4.6454 31.0926 7.5280 51.3251 21.2655 20.3193 11.1195 13.5924 5.9195 0.7539 39.3172
temp: 298.150 k
press: 1.00000 atm
elementType: 8 8 8 6 6 6 6 6 6 6 6 6 6 6 6 6 6 6 6 6 6 1 1 1 1 1 1 1 1 1 1 1 1 1 1 1 1 1 1 1 1 1 1 1 1
symmnumber: 1
zpe: 1005504.8 jmol-1
zpe.correction: 0.382977 hartree
zpe.thermalcorrener: 0.402017 hartree
zpe.thermalcorrenthalpy: 0.402962 hartree
zpe.thermalcorrgfe: 0.338022 hartree
zpe.sumelectzpe: -924.390929 hartree
zpe.sumelectthermal: -924.371888 hartree
zpe.sumelectthermalent: -924.370944 hartree
zpe.sumelectthermalfe: -924.435884 hartree
dipole: 1.6084 -1.0354 1.4101
dipole: 2.3764
quadrupole: -136.9772 -121.6349 -124.8342
quadrupole: -15.6017 -10.0789 3.4152
quadrupole: -9.1618 6.1805 2.9812 -15.6017 -10.0789 3.4152
hfenergy: -924.7739055 hartree
pointgroup: C01 [X(C18H24O3)]
dipole: 0.6344931 0.4019223 -0.5567801 debye
polarizability: 258.2299964|7.5078846|190.1781045|-4.1760318|7.3165498|137.2467995 unknown
InChI: InChI=1S/C18H24O3/c1-17-8-6-14-13-4-3-12(19)10-11(13)2-5-15(14)18(17,21)9-7-16(17)20/h3-4,10,14-16,19-21H,2,5-9H2,1H3
charge 0 multiplicity 1
45 atoms
O  -2.104866 -0.843068 1.721993
O  -5.016476 1.356398 -0.426668
O  6.033626 0.133077 -0.472917
C  -1.92186 -0.686277 0.242486
C  -2.557895 0.672393 -0.220717
C  -0.419049 -0.75948 -0.103559
C  0.339987 0.428198 0.575004
C  -4.053193 0.415772 0.158878
C  -1.849852 1.838227 0.505149
C  -2.887428 -1.755688 -0.31347
C  -0.31316 1.809567 0.263929
C  -4.297324 -1.07964 -0.238814
C  0.253159 -2.089066 0.296315
C  -2.467717 0.883208 -1.757868
C  1.845052 0.368111 0.25914
C  1.679485 -2.155522 -0.284459
C  2.473601 -0.862333 -0.107341
C  2.659482 1.523143 0.375156
C  3.867098 -0.897933 -0.342416
C  4.049611 1.490209 0.140418
C  4.65364 0.264479 -0.221788
H  -0.322018 -0.647858 -1.203636
H  0.252367 0.270699 1.677912
H  -4.185966 0.551405 1.243545
H  -2.064215 1.795698 1.593584
H  -2.261613 2.805388 0.159866
H  -2.831261 -2.66941 0.300206
H  -2.614727 -2.023899 -1.350168
H  -0.087034 2.0865 -0.783983
H  0.14911 2.591564 0.895526
H  -4.817662 -1.129045 -1.216123
H  -4.94955 -1.575333 0.498164
H  -0.336438 -2.948989 -0.073625
H  0.273129 -2.167052 1.400021
H  -2.960449 1.836842 -2.024248
H  -1.428186 0.945476 -2.117009
H  -2.960274 0.07114 -2.323867
H  1.616516 -2.378737 -1.370446
H  2.240442 -2.996378 0.166725
H  -1.578772 -0.144525 2.187149
H  -5.104837 1.160456 -1.394064
H  2.208202 2.479341 0.657646
H  4.359525 -1.835817 -0.622041
H  4.648977 2.404551 0.240085
H  6.493412 1.001408 -0.358668
