program: Orca
programVersion: 5.0.2
elementType: S S S P O O C C C C C C C C C H H H H H H H H H H H H H H H H H H H H H
charge: 0
multiplicity: 1
keywords: wb97x-d3
keywords: def2-TZVPP
keywords: def2/J RIJCOSX
keywords: DEFGRID2
keywords: scfconv7
keywords: smallprint printgap noloewdin
keywords: NOSOSCF
formula: C9H21O2PS3
InChI: InChI=1/C9H21O2PS3/c1-6-10-12(13,11-7-2)15-8-14-9(3,4)5/h6-8H2,1-5H3
36 atoms
S  1.939402 -1.20784 -1.06319
S  0.927835 1.478623 0.155207
S  -1.570541 0.432865 -1.923325
P  -1.062563 0.883777 -0.118829
O  -1.385653 -0.22011 0.995741
O  -1.719924 2.173981 0.552865
C  3.09675 -1.517051 0.346024
C  2.325484 -1.577102 1.659293
C  3.700596 -2.884645 0.035538
C  4.19294 -0.466387 0.410458
C  1.776028 0.57404 -1.181309
C  -1.368208 -1.637599 0.741929
C  -3.062828 2.611546 0.264569
C  -2.764885 -2.163558 0.531636
C  -4.117745 1.732704 0.889217
H  3.011685 -1.789094 2.48367
H  1.821072 -0.636886 1.878796
H  1.575453 -2.368475 1.641731
H  4.298273 -2.866438 -0.876572
H  2.934155 -3.654301 -0.076747
H  4.350859 -3.19258 0.857283
H  4.713655 -0.3571 -0.542071
H  3.815217 0.511631 0.7117
H  4.931031 -0.764995 1.158554
H  2.748092 1.060052 -1.264361
H  1.246644 0.762938 -2.115974
H  -0.728697 -1.865967 -0.111008
H  -0.912302 -2.087266 1.62317
H  -3.112962 3.621566 0.668648
H  -3.195949 2.678243 -0.817513
H  -3.411487 -1.93838 1.379351
H  -3.214934 -1.75619 -0.372857
H  -2.723635 -3.248457 0.424678
H  -4.161194 0.745583 0.429235
H  -3.959261 1.613927 1.96105
H  -5.092195 2.201873 0.746764
elementType: S P O C H
totalener: -2042.19610192 hartree
nucrepener: 1728.57949828 hartree
electener: -3770.77560020 hartree
oneelecener: -6252.65980661 hartree
twoeener: 2481.88420640 hartree
cpcmener: -0.01531168 hartree
kineticenergy: 2036.97610612 hartree
xcener: -124.862301569411 hartree
chargesum: -0.0000000
charge: -0.169713 -0.160081 -0.449259 0.640532 -0.340599 -0.351304 0.202315 -0.344116 -0.292243 -0.326924 -0.147295 0.060729 0.031101 -0.266204 -0.240027 0.111389 0.099335 0.092530 0.100985 0.102696 0.096115 0.105079 0.092584 0.104129 0.153639 0.162282 0.085307 0.105132 0.106241 0.092216 0.092352 0.079813 0.102142 0.078265 0.091399 0.099457
qa: -0.1697 -0.1601 -0.4493 0.6405 -0.3406 -0.3513 0.2023 -0.3441 -0.2922 -0.3269 -0.1473 0.0607 0.0311 -0.2662 -0.2400 0.1114 0.0993 0.0925 0.1010 0.1027 0.0961 0.1051 0.0926 0.1041 0.1536 0.1623 0.0853 0.1051 0.1062 0.0922 0.0924 0.0798 0.1021 0.0783 0.0914 0.0995
va: 2.2516 2.2973 1.9871 5.4127 2.0621 2.1169 3.8423 3.9269 3.8929 3.9315 3.9993 3.7874 3.8761 3.9605 3.8999 1.0068 1.0221 1.0090 1.0141 1.0077 1.0049 1.0073 1.0004 1.0048 0.9958 1.0180 1.0266 0.9926 0.9901 1.0082 1.0017 1.0135 1.0104 1.0074 1.0061 1.0103
dispcorr: -0.018969307 hartree
energy: -2042.215071228318
dipole: 4.88811 -4.49824 0.38987 -13.53182 13.12947 -0.40234 10.39476 -9.32196 1.07280
magnitude: 1.21028 au
magnitude: 3.07628 debye
