program: Orca
programVersion: 5.0.2
elementType: S S S P O O C C C C C C C C C H H H H H H H H H H H H H H H H H H H H H
charge: 0
multiplicity: 1
keywords: wb97x-d3
keywords: def2-TZVPP
keywords: def2/J RIJCOSX
keywords: DEFGRID2
keywords: scfconv7
keywords: smallprint printgap noloewdin
keywords: NOSOSCF
formula: C9H21O2PS3
InChI: InChI=1/C9H21O2PS3/c1-6-10-12(13,11-7-2)15-8-14-9(3,4)5/h6-8H2,1-5H3
36 atoms
S  1.924861 -0.725717 -1.05365
S  0.434702 0.730384 1.231062
S  -1.372145 0.78532 -1.669875
P  -1.412962 0.7078 0.252291
O  -2.214808 -0.535387 0.875369
O  -2.124606 1.911889 1.026601
C  3.334292 -1.452883 -0.117579
C  3.041214 -1.538917 1.374363
C  3.473142 -2.85735 -0.701761
C  4.605821 -0.653044 -0.375174
C  1.586456 0.810674 -0.187864
C  -2.2712 -1.824248 0.257629
C  -3.447359 2.323758 0.649115
C  -1.054717 -2.667194 0.567007
C  -3.392277 3.64334 -0.083689
H  2.099425 -2.049469 1.571867
H  3.840926 -2.09174 1.873359
H  2.992056 -0.556969 1.845962
H  3.643356 -2.832219 -1.779145
H  2.582324 -3.456901 -0.512573
H  4.324142 -3.36541 -0.243956
H  4.524808 0.374377 -0.016562
H  5.451339 -1.108062 0.146769
H  4.842111 -0.617333 -1.438188
H  2.501932 1.244911 0.213628
H  1.185132 1.508144 -0.920505
H  -3.175108 -2.286498 0.654778
H  -2.397596 -1.70901 -0.821734
H  -3.93552 1.565119 0.031884
H  -4.015325 2.406555 1.576076
H  -0.156685 -2.262512 0.100312
H  -0.88605 -2.741811 1.641081
H  -1.208488 -3.674568 0.178141
H  -4.403714 3.989713 -0.298312
H  -2.895143 4.40613 0.514559
H  -2.860382 3.53956 -1.028463
totalener: -2042.17910657 hartree
nucrepener: 1714.77710607 hartree
electener: -3756.95621264 hartree
oneelecener: -6224.62011434 hartree
twoeener: 2467.66390170 hartree
kineticenergy: 2037.01153636 hartree
xcener: -124.866981313383 hartree
chargesum: 0.0000000
charge: -0.117450 -0.134796 -0.403670 0.624155 -0.324278 -0.317614 0.153580 -0.303851 -0.283542 -0.287999 -0.152357 0.029875 0.022284 -0.222188 -0.220315 0.103765 0.094390 0.076732 0.104249 0.103149 0.086159 0.085400 0.087157 0.099609 0.127020 0.151107 0.090796 0.090362 0.077197 0.091970 0.052834 0.087310 0.083224 0.077376 0.084886 0.083475
qa: -0.1174 -0.1348 -0.4037 0.6242 -0.3243 -0.3176 0.1536 -0.3039 -0.2835 -0.2880 -0.1524 0.0299 0.0223 -0.2222 -0.2203 0.1038 0.0944 0.0767 0.1042 0.1031 0.0862 0.0854 0.0872 0.0996 0.1270 0.1511 0.0908 0.0904 0.0772 0.0920 0.0528 0.0873 0.0832 0.0774 0.0849 0.0835
va: 2.2681 2.2956 2.0412 5.4262 2.1109 2.1367 3.9029 3.9434 3.8989 3.9372 3.9982 3.8955 3.9243 3.8784 3.9253 1.0057 1.0100 1.0034 1.0106 1.0067 1.0066 1.0088 1.0060 1.0155 1.0140 1.0324 0.9908 1.0159 1.0064 0.9946 1.0556 1.0058 1.0182 1.0108 1.0055 1.0212
dispcorr: -0.017952783 hartree
energy: -2042.197059356240
dipole: 12.40106 -12.17698 0.22409 -10.32687 9.93452 -0.39235 2.26122 -1.67628 0.58494
magnitude: 0.73913 au
magnitude: 1.87872 debye
