program: Orca
programVersion: 5.0.2
elementType: S S S P O O C C C C C C C C C H H H H H H H H H H H H H H H H H H H H H
charge: 0
multiplicity: 1
keywords: wb97x-d3
keywords: def2-TZVPP
keywords: def2/J RIJCOSX
keywords: DEFGRID2
keywords: scfconv7
keywords: smallprint printgap noloewdin
keywords: NOSOSCF
formula: C9H21O2PS3
InChI: InChI=1/C9H21O2PS3/c1-6-10-12(13,11-7-2)15-8-14-9(3,4)5/h6-8H2,1-5H3
36 atoms
S  2.434333 -1.73773 0.472638
S  -0.213316 -0.604913 1.355003
S  -1.110799 0.810258 -1.635213
P  -1.540879 0.541966 0.228385
O  -3.0275 -0.023134 0.47355
O  -1.559207 1.814777 1.188335
C  3.234645 -0.278541 -0.318619
C  3.130569 -0.374205 -1.83587
C  2.646093 1.035335 0.177541
C  4.693218 -0.399733 0.119396
C  0.694917 -1.553232 0.075584
C  -3.649071 -0.954883 -0.410642
C  -2.29112 2.995299 0.819451
C  -3.007154 -2.324977 -0.370324
C  -1.345948 4.070303 0.337113
H  3.684942 0.445901 -2.298848
H  3.540842 -1.313283 -2.206143
H  2.098306 -0.289885 -2.178341
H  2.650395 1.093924 1.265121
H  1.622506 1.182697 -0.16646
H  3.238914 1.866689 -0.212837
H  4.793093 -0.328953 1.202971
H  5.136834 -1.342605 -0.204124
H  5.275446 0.410256 -0.323816
H  0.545026 -1.078146 -0.894994
H  0.272954 -2.555501 0.031164
H  -4.685348 -1.006391 -0.077422
H  -3.640049 -0.557016 -1.428555
H  -3.038783 2.769191 0.054914
H  -2.824995 3.308934 1.71654
H  -2.014067 -2.315384 -0.82044
H  -2.924257 -2.698506 0.649703
H  -3.6136 -3.027672 -0.942083
H  -0.840823 3.763749 -0.577694
H  -1.904826 4.983011 0.127528
H  -0.593709 4.301754 1.090321
totalener: -2042.17969463 hartree
nucrepener: 1712.92191155 hartree
electener: -3755.10160618 hartree
oneelecener: -6220.64530912 hartree
twoeener: 2465.54370294 hartree
kineticenergy: 2037.00434908 hartree
xcener: -124.865589289116 hartree
chargesum: -0.0000000
charge: -0.119256 -0.108603 -0.419081 0.634978 -0.328650 -0.318569 0.142480 -0.297793 -0.283838 -0.279165 -0.149669 0.020800 0.021436 -0.253790 -0.224587 0.086269 0.096664 0.096175 0.102995 0.068756 0.087274 0.105094 0.101277 0.084200 0.111344 0.143202 0.094994 0.092967 0.079922 0.094728 0.071500 0.101650 0.092191 0.085066 0.080154 0.086881
qa: -0.1193 -0.1086 -0.4191 0.6350 -0.3286 -0.3186 0.1425 -0.2978 -0.2838 -0.2792 -0.1497 0.0208 0.0214 -0.2538 -0.2246 0.0863 0.0967 0.0962 0.1030 0.0688 0.0873 0.1051 0.1013 0.0842 0.1113 0.1432 0.0950 0.0930 0.0799 0.0947 0.0715 0.1017 0.0922 0.0851 0.0802 0.0869
va: 2.2664 2.3173 2.0137 5.3956 2.1194 2.1317 3.9458 3.9423 3.9163 3.8716 4.0139 3.8979 3.9200 3.8964 3.9177 1.0066 1.0156 1.0073 1.0152 1.0305 1.0112 1.0129 1.0129 1.0070 1.0614 0.9925 0.9918 1.0113 1.0069 0.9937 1.0141 1.0042 1.0152 1.0189 1.0118 1.0046
dispcorr: -0.018524966 hartree
energy: -2042.198219596950
dipole: 9.54556 -10.11754 -0.57198 4.73898 -4.47634 0.26263 -7.08115 6.87293 -0.20822
magnitude: 0.66294 au
magnitude: 1.68507 debye
