program: Orca
programVersion: 5.0.2
elementType: S S S P O O C C C C C C C C C H H H H H H H H H H H H H H H H H H H H H
charge: 0
multiplicity: 1
keywords: wb97x-d3
keywords: def2-TZVPP
keywords: def2/J RIJCOSX
keywords: DEFGRID2
keywords: scfconv7
keywords: smallprint printgap noloewdin
keywords: NOSOSCF
formula: C9H21O2PS3
InChI: InChI=1/C9H21O2PS3/c1-6-10-12(13,11-7-2)15-8-14-9(3,4)5/h6-8H2,1-5H3
36 atoms
S  2.964455 -0.034108 1.000319
S  -0.020694 0.321755 1.130615
S  -0.658584 0.32326 -2.21356
P  -1.353293 0.655098 -0.455164
O  -2.597214 -0.235987 0.030606
O  -1.92413 2.136159 -0.302842
C  3.100475 -1.414506 -0.213968
C  1.82827 -2.250055 -0.265866
C  3.446052 -0.877883 -1.597408
C  4.257766 -2.250304 0.330184
C  1.560506 0.919493 0.420202
C  -2.731971 -1.627793 -0.285395
C  -2.507088 2.654738 0.898908
C  -2.272291 -2.507927 0.854788
C  -4.017182 2.603174 0.850038
H  1.998488 -3.12938 -0.892507
H  1.53289 -2.590913 0.726211
H  0.99568 -1.698924 -0.702842
H  2.639767 -0.274831 -2.016733
H  3.606538 -1.710486 -2.286742
H  4.353511 -0.275038 -1.576389
H  4.0351 -2.647429 1.321175
H  4.440903 -3.095675 -0.335601
H  5.180674 -1.671987 0.393613
H  1.717222 1.948261 0.737603
H  1.48447 0.905364 -0.667732
H  -3.792076 -1.779433 -0.489639
H  -2.183563 -1.852368 -1.203611
H  -2.121059 2.126247 1.775139
H  -2.161001 3.686336 0.968496
H  -2.47331 -3.550975 0.60852
H  -1.203465 -2.406761 1.038146
H  -2.803013 -2.274568 1.777348
H  -4.400025 3.11934 -0.029518
H  -4.385551 1.579538 0.838226
H  -4.424139 3.0986 1.732125
totalener: -2042.18019240 hartree
nucrepener: 1710.76608045 hartree
electener: -3752.94627284 hartree
oneelecener: -6216.23208528 hartree
twoeener: 2463.28581243 hartree
kineticenergy: 2036.99599337 hartree
xcener: -124.865740224340 hartree
chargesum: 0.0000000
charge: -0.122351 -0.170661 -0.381308 0.633888 -0.328831 -0.312473 0.148530 -0.283967 -0.297942 -0.277475 -0.118813 0.017872 0.022217 -0.215415 -0.235250 0.089538 0.098503 0.053898 0.097118 0.086089 0.097925 0.104024 0.084554 0.102246 0.146438 0.106460 0.094572 0.084458 0.083952 0.094811 0.084453 0.068953 0.089471 0.088394 0.084777 0.081344
qa: -0.1224 -0.1707 -0.3813 0.6339 -0.3288 -0.3125 0.1485 -0.2840 -0.2979 -0.2775 -0.1188 0.0179 0.0222 -0.2154 -0.2353 0.0895 0.0985 0.0539 0.0971 0.0861 0.0979 0.1040 0.0846 0.1022 0.1464 0.1065 0.0946 0.0845 0.0840 0.0948 0.0845 0.0690 0.0895 0.0884 0.0848 0.0813
va: 2.2587 2.2817 2.0655 5.4274 2.1021 2.1519 3.9495 3.8964 3.9403 3.8680 3.9760 3.8882 3.8989 3.9085 3.9291 1.0148 1.0101 1.0512 1.0096 1.0062 1.0152 1.0127 1.0070 1.0132 1.0036 1.0691 0.9927 1.0213 1.0098 0.9917 1.0135 1.0155 1.0064 1.0056 1.0153 1.0099
dispcorr: -0.018516714 hartree
energy: -2042.198709111502
dipole: 3.43891 -3.98776 -0.54885 -12.33764 11.96394 -0.37370 2.49962 -1.84371 0.65590
magnitude: 0.93332 au
magnitude: 2.37232 debye
