program: Orca
programVersion: 5.0.2
elementType: S S S P O O C C C C C C C C C H H H H H H H H H H H H H H H H H H H H H
charge: 0
multiplicity: 1
keywords: wb97x-d3
keywords: def2-TZVPP
keywords: def2/J RIJCOSX
keywords: DEFGRID2
keywords: scfconv7
keywords: smallprint printgap noloewdin
keywords: NOSOSCF
formula: C9H21O2PS3
InChI: InChI=1/C9H21O2PS3/c1-6-10-12(13,11-7-2)15-8-14-9(3,4)5/h6-8H2,1-5H3
36 atoms
S  2.972322 -0.046735 0.997978
S  -0.009075 0.353916 1.134831
S  -0.627047 0.373451 -2.21681
P  -1.334649 0.679516 -0.458663
O  -2.565884 -0.235606 0.014332
O  -1.934706 2.147998 -0.298471
C  3.078746 -1.432588 -0.212918
C  1.796934 -2.254608 -0.24814
C  3.415284 -0.906279 -1.602402
C  4.23193 -2.279923 0.322383
C  1.581155 0.930235 0.426211
C  -2.666163 -1.631569 -0.29664
C  -2.539426 2.642631 0.902828
C  -2.259744 -2.49331 0.877129
C  -4.047923 2.566147 0.836847
H  0.968098 -1.69723 -0.684094
H  1.952876 -3.140938 -0.868622
H  1.5048 -2.583893 0.748795
H  3.561258 -1.744225 -2.288488
H  4.328361 -0.311708 -1.593961
H  2.610016 -0.298586 -2.016923
H  5.162576 -1.712789 0.371786
H  4.016082 -2.669147 1.318056
H  4.396609 -3.13108 -0.340845
H  1.754284 1.954322 0.750593
H  1.503237 0.925323 -0.661727
H  -3.711132 -1.799973 -0.558323
H  -2.065452 -1.858262 -1.181033
H  -2.154072 2.111066 1.777551
H  -2.211716 3.679068 0.987933
H  -2.846156 -2.259515 1.765225
H  -2.430139 -3.541872 0.631106
H  -1.204802 -2.372495 1.119356
H  -4.429998 3.085993 -0.040944
H  -4.398925 1.536717 0.809315
H  -4.472644 3.044591 1.719979
totalener: -2042.18010073 hartree
nucrepener: 1711.76248073 hartree
electener: -3753.94258147 hartree
oneelecener: -6218.21671730 hartree
twoeener: 2464.27413584 hartree
kineticenergy: 2036.99441567 hartree
xcener: -124.865471547581 hartree
chargesum: 0.0000000
charge: -0.121794 -0.171187 -0.380711 0.633307 -0.328217 -0.312315 0.149916 -0.283818 -0.298825 -0.278005 -0.119938 0.016846 0.022099 -0.215243 -0.235419 0.051979 0.089598 0.098776 0.086107 0.098168 0.097498 0.102425 0.104086 0.084496 0.146731 0.107627 0.096314 0.082948 0.083854 0.094933 0.089508 0.084396 0.069216 0.088404 0.085036 0.081202
qa: -0.1218 -0.1712 -0.3807 0.6333 -0.3282 -0.3123 0.1499 -0.2838 -0.2988 -0.2780 -0.1199 0.0168 0.0221 -0.2152 -0.2354 0.0520 0.0896 0.0988 0.0861 0.0982 0.0975 0.1024 0.1041 0.0845 0.1467 0.1076 0.0963 0.0829 0.0839 0.0949 0.0895 0.0844 0.0692 0.0884 0.0850 0.0812
va: 2.2591 2.2828 2.0657 5.4276 2.1000 2.1531 3.9499 3.8982 3.9386 3.8683 3.9768 3.8866 3.9007 3.9095 3.9278 1.0495 1.0149 1.0103 1.0062 1.0153 1.0108 1.0133 1.0125 1.0070 1.0033 1.0690 0.9934 1.0206 1.0091 0.9919 1.0066 1.0131 1.0165 1.0056 1.0154 1.0099
dispcorr: -0.018592464 hartree
energy: -2042.198693195491
dipole: 3.13441 -3.69159 -0.55718 -12.73669 12.33657 -0.40012 2.55726 -1.89806 0.65920
magnitude: 0.95137 au
magnitude: 2.41818 debye
