program: Orca
programVersion: 5.0.2
elementType: S S S P O O C C C C C C C C C H H H H H H H H H H H H H H H H H H H H H
charge: 0
multiplicity: 1
keywords: wb97x-d3
keywords: def2-TZVPP
keywords: def2/J RIJCOSX
keywords: DEFGRID2
keywords: scfconv7
keywords: smallprint printgap noloewdin
keywords: NOSOSCF
formula: C9H21O2PS3
InChI: InChI=1/C9H21O2PS3/c1-6-10-12(13,11-7-2)15-8-14-9(3,4)5/h6-8H2,1-5H3
36 atoms
S  2.008163 0.311934 -1.018238
S  -0.053601 -1.624273 0.271645
S  -1.8193 0.381749 -1.840626
P  -1.394197 -0.058971 -0.016951
O  -2.617081 -0.53546 0.906521
O  -0.750007 1.094905 0.878522
C  3.35615 0.080562 0.213446
C  2.820886 -0.325409 1.580591
C  4.373773 -0.933493 -0.294789
C  3.996876 1.465158 0.299726
C  1.143141 -1.259733 -1.065509
C  -3.781305 -1.175791 0.374521
C  -1.137711 2.468164 0.759976
C  -3.536757 -2.617485 -0.012105
C  0.051899 3.330376 1.109652
H  2.423418 -1.33938 1.583994
H  3.631198 -0.290882 2.313632
H  2.024837 0.339387 1.913773
H  3.940352 -1.928757 -0.404294
H  5.20042 -1.02433 0.414178
H  4.783766 -0.636426 -1.259544
H  3.291562 2.20639 0.678108
H  4.847375 1.434586 0.983531
H  4.362236 1.805308 -0.670486
H  0.601064 -1.273881 -2.010823
H  1.834035 -2.103086 -1.064362
H  -4.523477 -1.109333 1.169901
H  -4.150424 -0.607399 -0.482415
H  -1.476902 2.674549 -0.258031
H  -1.973206 2.653682 1.439748
H  -3.128421 -3.192418 0.818441
H  -4.481397 -3.075264 -0.307619
H  -2.851753 -2.695718 -0.85571
H  0.869167 3.159517 0.40996
H  -0.229382 4.382335 1.058206
H  0.408842 3.127466 2.119393
totalener: -2042.17991825 hartree
nucrepener: 1736.39244924 hartree
electener: -3778.57236749 hartree
oneelecener: -6267.94465145 hartree
twoeener: 2489.37228396 hartree
kineticenergy: 2037.01412929 hartree
xcener: -124.867316640755 hartree
chargesum: 0.0000000
charge: -0.115748 -0.145639 -0.408860 0.626847 -0.337936 -0.299855 0.147686 -0.296567 -0.299729 -0.281594 -0.160382 0.021378 0.023156 -0.243285 -0.243886 0.083817 0.089884 0.101897 0.084720 0.088250 0.101136 0.099762 0.086087 0.104936 0.158855 0.128968 0.093053 0.091441 0.090540 0.096612 0.088861 0.086807 0.085376 0.079569 0.087559 0.086283
qa: -0.1157 -0.1456 -0.4089 0.6268 -0.3379 -0.2999 0.1477 -0.2966 -0.2997 -0.2816 -0.1604 0.0214 0.0232 -0.2433 -0.2439 0.0838 0.0899 0.1019 0.0847 0.0883 0.1011 0.0998 0.0861 0.1049 0.1589 0.1290 0.0931 0.0914 0.0905 0.0966 0.0889 0.0868 0.0854 0.0796 0.0876 0.0863
va: 2.2634 2.2820 2.0353 5.4321 2.1158 2.1280 3.9260 3.9172 3.9344 3.8843 4.0147 3.9021 3.8641 3.8890 3.9364 1.0116 1.0089 1.0193 1.0082 1.0063 1.0149 1.0088 1.0080 1.0117 1.0203 1.0082 0.9905 1.0143 1.0152 0.9934 1.0043 1.0140 1.0208 1.0143 1.0139 1.0024
dispcorr: -0.018378466 hartree
energy: -2042.198296713465
dipole: 14.97126 -14.68257 0.28869 2.94541 -3.08557 -0.14016 7.99378 -7.24637 0.74741
magnitude: 0.81339 au
magnitude: 2.06747 debye
