program: Orca
programVersion: 5.0.2
elementType: S S S P O O C C C C C C C C C H H H H H H H H H H H H H H H H H H H H H
charge: 0
multiplicity: 1
keywords: wb97x-d3
keywords: def2-TZVPP
keywords: def2/J RIJCOSX
keywords: DEFGRID2
keywords: scfconv7
keywords: smallprint printgap noloewdin
keywords: NOSOSCF
formula: C9H21O2PS3
InChI: InChI=1/C9H21O2PS3/c1-6-10-12(13,11-7-2)15-8-14-9(3,4)5/h6-8H2,1-5H3
36 atoms
S  2.958101 0.299974 0.706216
S  -0.018302 0.412934 1.057275
S  -1.122073 -0.526641 -2.026529
P  -1.533589 0.379209 -0.386316
O  -2.736206 -0.210908 0.499421
O  -1.972673 1.8942 -0.632073
C  3.186122 -1.343858 -0.096321
C  3.432108 -1.174697 -1.590525
C  4.436325 -1.899786 0.582654
C  1.997201 -2.262693 0.151521
C  1.412975 0.901407 0.019932
C  -3.104796 -1.596451 0.472519
C  -2.345278 2.802911 0.410871
C  -2.152901 -2.469726 1.25805
C  -3.847579 2.916916 0.532591
H  4.275468 -0.512392 -1.783506
H  3.650532 -2.144995 -2.043027
H  2.557686 -0.776151 -2.10685
H  4.682224 -2.872925 0.153707
H  4.284892 -2.034564 1.654082
H  5.299037 -1.247252 0.439434
H  1.77595 -2.354087 1.214509
H  1.096835 -1.914576 -0.355969
H  2.22281 -3.258795 -0.237841
H  1.471344 1.987475 -0.012536
H  1.257066 0.53723 -0.996536
H  -4.104855 -1.626471 0.903827
H  -3.172211 -1.933358 -0.564104
H  -1.892522 2.506926 1.361377
H  -1.909272 3.762878 0.132302
H  -2.035664 -2.116349 2.282041
H  -2.545963 -3.486226 1.295043
H  -1.167942 -2.51156 0.794321
H  -4.298508 3.208493 -0.415147
H  -4.297414 1.980503 0.856479
H  -4.093792 3.68203 1.269703
totalener: -2042.18055722 hartree
nucrepener: 1706.88960899 hartree
electener: -3749.07016621 hartree
oneelecener: -6208.51699652 hartree
twoeener: 2459.44683031 hartree
kineticenergy: 2036.99756891 hartree
xcener: -124.865256165331 hartree
chargesum: 0.0000000
charge: -0.122261 -0.157523 -0.384283 0.628254 -0.333611 -0.313703 0.148254 -0.298369 -0.276314 -0.290470 -0.118511 0.016017 0.024446 -0.231829 -0.237366 0.097740 0.086799 0.098687 0.084846 0.103621 0.102668 0.102102 0.054979 0.091116 0.145640 0.100482 0.089792 0.095492 0.085407 0.094296 0.089550 0.088399 0.081060 0.088819 0.085001 0.080771
qa: -0.1223 -0.1575 -0.3843 0.6283 -0.3336 -0.3137 0.1483 -0.2984 -0.2763 -0.2905 -0.1185 0.0160 0.0244 -0.2318 -0.2374 0.0977 0.0868 0.0987 0.0848 0.1036 0.1027 0.1021 0.0550 0.0911 0.1456 0.1005 0.0898 0.0955 0.0854 0.0943 0.0895 0.0884 0.0811 0.0888 0.0850 0.0808
va: 2.2598 2.2840 2.0621 5.4218 2.1005 2.1393 3.9541 3.9444 3.8691 3.9013 3.9844 3.9051 3.8856 3.8941 3.9383 1.0150 1.0062 1.0047 1.0069 1.0136 1.0122 1.0105 1.0443 1.0134 1.0040 1.0640 0.9906 1.0132 1.0119 0.9908 1.0044 1.0162 1.0042 1.0051 1.0142 1.0099
dispcorr: -0.018354946 hartree
energy: -2042.198912170539
dipole: 5.75824 -6.16100 -0.40277 -9.70762 9.61381 -0.09380 3.80735 -3.09854 0.70881
magnitude: 0.82063 au
magnitude: 2.08587 debye
