program: Orca
programVersion: 5.0.2
elementType: S S S P O O C C C C C C C C C H H H H H H H H H H H H H H H H H H H H H
charge: 0
multiplicity: 1
keywords: wb97x-d3
keywords: def2-TZVPP
keywords: def2/J RIJCOSX
keywords: DEFGRID2
keywords: scfconv7
keywords: smallprint printgap noloewdin
keywords: NOSOSCF
formula: C9H21O2PS3
InChI: InChI=1/C9H21O2PS3/c1-6-10-12(13,11-7-2)15-8-14-9(3,4)5/h6-8H2,1-5H3
36 atoms
S  1.836493 -1.123521 -0.864651
S  0.547131 1.161506 0.746344
S  -1.357255 0.807953 -2.030832
P  -1.357434 0.877816 -0.109038
O  -2.05048 -0.337315 0.654919
O  -2.174946 2.042597 0.617301
C  3.257145 -1.570229 0.218798
C  4.549438 -1.007214 -0.361734
C  3.05774 -1.092247 1.650609
C  3.286402 -3.096339 0.175222
C  1.648006 0.645234 -0.611645
C  -1.789328 -1.701098 0.295982
C  -2.0467 3.394241 0.155177
C  -1.028951 -2.397047 1.399142
C  -3.227229 3.782903 -0.703467
H  4.549329 0.083901 -0.380054
H  5.403057 -1.316236 0.246675
H  4.7123 -1.357933 -1.380264
H  2.122631 -1.457855 2.072989
H  3.054536 -0.00486 1.730838
H  3.877609 -1.456293 2.274853
H  3.403121 -3.467474 -0.84407
H  4.129943 -3.466391 0.761203
H  2.374186 -3.525469 0.590968
H  2.608993 1.119264 -0.411262
H  1.258367 1.062806 -1.539601
H  -2.762578 -2.164847 0.133982
H  -1.239688 -1.754648 -0.646541
H  -1.989377 4.011352 1.051928
H  -1.109821 3.528606 -0.393297
H  -0.879116 -3.443801 1.132625
H  -0.049214 -1.943792 1.53942
H  -1.570651 -2.362107 2.3436
H  -3.270807 3.175826 -1.606593
H  -4.165535 3.67034 -0.161213
H  -3.13382 4.828049 -1.00147
totalener: -2042.18059260 hartree
nucrepener: 1719.09018514 hartree
electener: -3761.27077774 hartree
oneelecener: -6233.00628766 hartree
twoeener: 2471.73550992 hartree
kineticenergy: 2037.00906215 hartree
xcener: -124.867731200454 hartree
chargesum: 0.0000000
charge: -0.128402 -0.162895 -0.398990 0.620589 -0.301411 -0.318020 0.150888 -0.291185 -0.321276 -0.277646 -0.153999 0.021740 0.030910 -0.194842 -0.225394 0.086531 0.088337 0.100972 0.120377 0.078735 0.097967 0.104978 0.086704 0.098906 0.125039 0.159249 0.099022 0.079132 0.096383 0.072367 0.082561 0.028747 0.094724 0.085993 0.085590 0.077619
qa: -0.1284 -0.1629 -0.3990 0.6206 -0.3014 -0.3180 0.1509 -0.2912 -0.3213 -0.2776 -0.1540 0.0217 0.0309 -0.1948 -0.2254 0.0865 0.0883 0.1010 0.1204 0.0787 0.0980 0.1050 0.0867 0.0989 0.1250 0.1592 0.0990 0.0791 0.0964 0.0724 0.0826 0.0287 0.0947 0.0860 0.0856 0.0776
va: 2.2614 2.2875 2.0457 5.4598 2.1456 2.1353 3.9122 3.9344 3.9528 3.8888 3.9943 3.8897 3.8922 3.9161 3.9355 1.0086 1.0062 1.0159 0.9891 1.0052 1.0091 1.0104 1.0072 1.0111 1.0123 1.0341 0.9963 1.0182 0.9925 1.0150 1.0114 1.0368 1.0125 1.0219 1.0054 1.0096
dispcorr: -0.018315914 hartree
energy: -2042.198908518276
dipole: 15.20931 -14.29330 0.91601 -9.15960 9.11364 -0.04596 6.63456 -5.96751 0.66705
magnitude: 1.13408 au
magnitude: 2.88261 debye
