program: Orca
programVersion: 5.0.2
elementType: S S S P O O C C C C C C C C C H H H H H H H H H H H H H H H H H H H H H
charge: 0
multiplicity: 1
keywords: wb97x-d3
keywords: def2-TZVPP
keywords: def2/J RIJCOSX
keywords: DEFGRID2
keywords: scfconv7
keywords: smallprint printgap noloewdin
keywords: NOSOSCF
formula: C9H21O2PS3
InChI: InChI=1/C9H21O2PS3/c1-6-10-12(13,11-7-2)15-8-14-9(3,4)5/h6-8H2,1-5H3
36 atoms
S  2.110154 0.030648 -0.974121
S  -0.058349 -1.147924 0.872813
S  -1.705905 -0.334946 -1.967685
P  -1.640207 -0.118447 -0.058675
O  -2.874558 -0.624975 0.818251
O  -1.629056 1.371803 0.502781
C  3.593254 -0.085406 0.112142
C  4.448069 -1.280472 -0.29361
C  4.346263 1.213789 -0.165956
C  3.223774 -0.167882 1.586819
C  1.109778 -1.387238 -0.506137
C  -3.411134 -1.938575 0.616754
C  -0.767107 2.379435 -0.042595
C  -4.654151 -1.89034 -0.240897
C  0.238575 2.816526 0.994746
H  3.926779 -2.227477 -0.144386
H  4.74182 -1.22168 -1.340987
H  5.355551 -1.317526 0.314084
H  3.757844 2.085353 0.123071
H  4.604528 1.312416 -1.22128
H  5.275973 1.231445 0.405968
H  4.132317 -0.134126 2.193205
H  2.584462 0.659454 1.891286
H  2.706306 -1.09462 1.835741
H  0.53829 -1.679327 -1.386964
H  1.73513 -2.232951 -0.219659
H  -2.660099 -2.599759 0.174685
H  -3.634004 -2.322352 1.612426
H  -0.262335 2.014616 -0.940214
H  -1.411166 3.206708 -0.342703
H  -4.423719 -1.543826 -1.247011
H  -5.085746 -2.889025 -0.315036
H  -5.405607 -1.230296 0.191022
H  -0.249854 3.187567 1.895026
H  0.895925 1.992723 1.267516
H  0.855273 3.618918 0.588552
totalener: -2042.18068321 hartree
nucrepener: 1718.13410351 hartree
electener: -3760.31478672 hartree
oneelecener: -6231.08176730 hartree
twoeener: 2470.76698058 hartree
kineticenergy: 2037.01425716 hartree
xcener: -124.868614199696 hartree
chargesum: -0.0000000
charge: -0.125698 -0.164692 -0.397765 0.618986 -0.316109 -0.300203 0.149140 -0.292425 -0.277631 -0.322733 -0.158662 0.029586 0.022554 -0.226475 -0.198540 0.086484 0.101325 0.088498 0.099691 0.104840 0.086725 0.097791 0.121603 0.080187 0.160747 0.126918 0.073039 0.096194 0.077679 0.098944 0.086322 0.077495 0.085909 0.095407 0.032337 0.082530
qa: -0.1257 -0.1647 -0.3978 0.6190 -0.3161 -0.3002 0.1491 -0.2924 -0.2776 -0.3227 -0.1587 0.0296 0.0226 -0.2265 -0.1985 0.0865 0.1013 0.0885 0.0997 0.1048 0.0867 0.0978 0.1216 0.0802 0.1607 0.1269 0.0730 0.0962 0.0777 0.0989 0.0863 0.0775 0.0859 0.0954 0.0323 0.0825
va: 2.2612 2.2856 2.0480 5.4657 2.1398 2.1434 3.9159 3.9329 3.8853 3.9526 3.9973 3.8922 3.8870 3.9333 3.9189 1.0090 1.0155 1.0063 1.0113 1.0110 1.0072 1.0091 0.9890 1.0051 1.0337 1.0114 1.0147 0.9922 1.0192 0.9969 1.0217 1.0099 1.0053 1.0126 1.0347 1.0108
dispcorr: -0.018347986 hartree
energy: -2042.199031196026
dipole: 17.99694 -17.12836 0.86858 1.88013 -2.17744 -0.29731 6.23378 -5.51721 0.71658
magnitude: 1.16460 au
magnitude: 2.96019 debye
