program: Orca
programVersion: 5.0.2
elementType: S S S P O O C C C C C C C C C H H H H H H H H H H H H H H H H H H H H H
charge: 0
multiplicity: 1
keywords: wb97x-d3
keywords: def2-TZVPP
keywords: def2/J RIJCOSX
keywords: DEFGRID2
keywords: scfconv7
keywords: smallprint printgap noloewdin
keywords: NOSOSCF
formula: C9H21O2PS3
InChI: InChI=1/C9H21O2PS3/c1-6-10-12(13,11-7-2)15-8-14-9(3,4)5/h6-8H2,1-5H3
36 atoms
S  2.906215 0.292361 -0.098022
S  0.096813 0.281819 -1.128565
S  -3.176101 0.246289 -1.533831
P  -1.782608 0.495744 -0.245903
O  -1.75087 -0.482596 1.028489
O  -1.743915 1.869423 0.578886
C  3.110706 -1.413506 0.563993
C  4.531581 -1.790493 0.150696
C  2.992803 -1.412498 2.083031
C  2.112192 -2.380411 -0.056175
C  1.198432 0.70609 0.277117
C  -1.894463 -1.891653 0.832919
C  -2.278585 3.081004 0.033913
C  -1.446515 -2.592963 2.093042
C  -1.4043 3.675389 -1.046837
H  5.269105 -1.102165 0.565426
H  4.766953 -2.790849 0.518297
H  4.643479 -1.797375 -0.933531
H  1.995231 -1.125063 2.418983
H  3.709397 -0.729251 2.537105
H  3.18292 -2.415085 2.473209
H  2.170397 -2.374446 -1.143863
H  2.317051 -3.395217 0.293905
H  1.085488 -2.140629 0.219069
H  0.861669 0.209051 1.185251
H  1.155095 1.779637 0.44757
H  -2.938745 -2.115501 0.605388
H  -1.295327 -2.221235 -0.02227
H  -3.28554 2.896084 -0.346161
H  -2.357747 3.755677 0.885611
H  -1.579604 -3.668918 1.980881
H  -0.392188 -2.407434 2.301278
H  -2.028028 -2.270461 2.956059
H  -1.808751 4.642988 -1.344737
H  -0.38408 3.833714 -0.697707
H  -1.372623 3.042177 -1.932784
totalener: -2042.18128407 hartree
nucrepener: 1702.86044168 hartree
electener: -3745.04172575 hartree
oneelecener: -6200.09594504 hartree
twoeener: 2455.05421929 hartree
kineticenergy: 2037.00335125 hartree
xcener: -124.864864057786 hartree
chargesum: -0.0000000
charge: -0.115839 -0.120180 -0.379347 0.585323 -0.313712 -0.321630 0.151293 -0.281173 -0.309016 -0.259229 -0.139778 -0.019937 0.025069 -0.214715 -0.244683 0.103206 0.086223 0.106851 0.082518 0.104276 0.092879 0.111243 0.095051 0.018027 0.107729 0.142838 0.121788 0.093351 0.092775 0.096666 0.082856 0.059288 0.095520 0.089855 0.079412 0.095200
qa: -0.1158 -0.1202 -0.3793 0.5853 -0.3137 -0.3216 0.1513 -0.2812 -0.3090 -0.2592 -0.1398 -0.0199 0.0251 -0.2147 -0.2447 0.1032 0.0862 0.1069 0.0825 0.1043 0.0929 0.1112 0.0951 0.0180 0.1077 0.1428 0.1218 0.0934 0.0928 0.0967 0.0829 0.0593 0.0955 0.0899 0.0794 0.0952
va: 2.2651 2.2988 2.0871 5.4629 2.1021 2.1075 3.9401 3.8774 3.9464 3.9240 4.0309 3.8715 3.8773 3.9492 3.9015 1.0125 1.0058 1.0131 1.0063 1.0176 1.0040 1.0172 1.0105 1.0150 1.0354 1.0040 1.0083 0.9873 1.0157 0.9907 1.0097 1.0066 1.0066 1.0149 1.0045 1.0150
dispcorr: -0.018786140 hartree
energy: -2042.200070205640
dipole: 15.69404 -14.99205 0.70198 -10.52925 10.19921 -0.33004 12.36479 -11.26113 1.10366
magnitude: 1.34899 au
magnitude: 3.42886 debye
