program: Orca
programVersion: 5.0.2
elementType: S S S P O O C C C C C C C C C H H H H H H H H H H H H H H H H H H H H H
charge: 0
multiplicity: 1
keywords: wb97x-d3
keywords: def2-TZVPP
keywords: def2/J RIJCOSX
keywords: DEFGRID2
keywords: scfconv7
keywords: smallprint printgap noloewdin
keywords: NOSOSCF
formula: C9H21O2PS3
InChI: InChI=1/C9H21O2PS3/c1-6-10-12(13,11-7-2)15-8-14-9(3,4)5/h6-8H2,1-5H3
36 atoms
S  2.610342 -1.701886 0.05047
S  0.058589 -0.500471 -1.018176
S  -2.780927 1.128284 -1.387685
P  -1.644855 0.27609 -0.099567
O  -2.234387 -0.938763 0.764432
O  -1.133796 1.156578 1.139318
C  3.518367 -0.119524 0.32397
C  4.976753 -0.565032 0.423231
C  3.347583 0.827969 -0.857781
C  3.08999 0.548126 1.622907
C  0.889203 -1.330099 0.394655
C  -2.939401 -2.000147 0.10663
C  -1.09672 2.587146 1.078534
C  -4.431487 -1.827183 0.268351
C  0.025587 3.114032 0.212826
H  5.619037 0.310211 0.538736
H  5.141013 -1.220584 1.278552
H  5.299318 -1.09159 -0.476339
H  2.315555 1.15486 -0.972255
H  3.650948 0.354356 -1.790894
H  3.966942 1.71704 -0.712451
H  2.066649 0.92274 1.577077
H  3.167618 -0.133309 2.470446
H  3.733461 1.407975 1.822271
H  0.409283 -2.291685 0.568095
H  0.781136 -0.734769 1.298689
H  -2.667402 -2.050105 -0.951855
H  -2.597159 -2.923703 0.575048
H  -2.059216 2.961647 0.72419
H  -0.971648 2.904662 2.113268
H  -4.709808 -1.774917 1.320349
H  -4.774765 -0.921476 -0.228794
H  -4.950654 -2.676919 -0.175704
H  0.996732 2.742865 0.538713
H  -0.115094 2.84578 -0.833754
H  0.046166 4.202509 0.275385
totalener: -2042.17998910 hartree
nucrepener: 1705.46497752 hartree
electener: -3747.64496662 hartree
oneelecener: -6205.39845403 hartree
twoeener: 2457.75348741 hartree
kineticenergy: 2037.00203101 hartree
xcener: -124.866080867277 hartree
chargesum: 0.0000000
charge: -0.111535 -0.122183 -0.386159 0.595074 -0.318269 -0.327603 0.159559 -0.275312 -0.296098 -0.320828 -0.160396 0.015124 0.024203 -0.219695 -0.253980 0.085125 0.103267 0.104166 0.076869 0.102992 0.088761 0.061348 0.112094 0.097318 0.139964 0.132454 0.087629 0.090291 0.100936 0.098835 0.084068 0.086172 0.078217 0.076179 0.094580 0.096834
qa: -0.1115 -0.1222 -0.3862 0.5951 -0.3183 -0.3276 0.1596 -0.2753 -0.2961 -0.3208 -0.1604 0.0151 0.0242 -0.2197 -0.2540 0.0851 0.1033 0.1042 0.0769 0.1030 0.0888 0.0613 0.1121 0.0973 0.1400 0.1325 0.0876 0.0903 0.1009 0.0988 0.0841 0.0862 0.0782 0.0762 0.0946 0.0968
va: 2.2789 2.2993 2.0682 5.4547 2.1052 2.0974 3.9029 3.8730 3.9175 3.9235 4.0696 3.9015 3.8510 3.9400 3.9114 1.0064 1.0152 1.0109 1.0296 1.0185 1.0050 1.0193 1.0148 1.0062 1.0001 1.0129 1.0061 0.9908 1.0183 0.9927 1.0053 1.0239 1.0103 0.9961 1.0160 1.0170
dispcorr: -0.018800421 hartree
energy: -2042.198789519921
dipole: 15.23024 -14.61251 0.61773 5.25816 -5.14530 0.11286 8.34252 -7.36876 0.97376
magnitude: 1.15868 au
magnitude: 2.94514 debye
