program: Orca
programVersion: 5.0.2
elementType: S S S P O O C C C C C C C C C H H H H H H H H H H H H H H H H H H H H H
charge: 0
multiplicity: 1
keywords: wb97x-d3
keywords: def2-TZVPP
keywords: def2/J RIJCOSX
keywords: DEFGRID2
keywords: scfconv7
keywords: smallprint printgap noloewdin
keywords: NOSOSCF
formula: C9H21O2PS3
InChI: InChI=1/C9H21O2PS3/c1-6-10-12(13,11-7-2)15-8-14-9(3,4)5/h6-8H2,1-5H3
36 atoms
S  1.601636 -1.350348 1.059199
S  -0.286073 0.890952 1.702032
S  -0.140067 1.994993 -1.536642
P  -1.079638 0.942314 -0.237278
O  -1.254655 -0.5653 -0.732906
O  -2.548858 1.418877 0.198784
C  2.961322 -1.462838 -0.178505
C  2.53352 -0.869568 -1.51434
C  4.220246 -0.78626 0.349908
C  3.195094 -2.964314 -0.327342
C  1.426888 0.433981 1.312078
C  -1.899742 -1.582912 0.041011
C  -3.269309 2.454399 -0.484769
C  -1.638241 -2.911055 -0.624738
C  -3.004672 3.805204 0.136615
H  2.33426 0.200396 -1.457736
H  3.325688 -1.011578 -2.253919
H  1.62705 -1.344744 -1.8869
H  4.080379 0.286821 0.487881
H  5.04084 -0.912989 -0.360495
H  4.528735 -1.212686 1.304321
H  2.30221 -3.474081 -0.692675
H  3.99428 -3.140632 -1.049907
H  3.489001 -3.424337 0.61666
H  2.013933 0.771074 2.165792
H  1.746797 0.99838 0.434633
H  -1.502735 -1.582217 1.058776
H  -2.971131 -1.372993 0.094223
H  -3.00809 2.460186 -1.544857
H  -4.320534 2.179321 -0.398735
H  -2.128642 -3.704952 -0.061273
H  -2.024134 -2.932763 -1.64339
H  -0.569953 -3.122928 -0.649564
H  -1.961974 4.094436 0.010722
H  -3.623685 4.559837 -0.349716
H  -3.24368 3.807251 1.19953
totalener: -2042.17981706 hartree
nucrepener: 1729.68880621 hartree
electener: -3771.86862327 hartree
oneelecener: -6254.34883266 hartree
twoeener: 2482.48020939 hartree
kineticenergy: 2037.00277461 hartree
xcener: -124.864694172800 hartree
chargesum: -0.0000000
charge: -0.147383 -0.137386 -0.386982 0.630238 -0.288385 -0.350575 0.148901 -0.289213 -0.296662 -0.280071 -0.131898 -0.030953 0.016319 -0.204673 -0.221742 0.087512 0.089648 0.099862 0.083561 0.089787 0.099290 0.100938 0.086751 0.103774 0.144898 0.111586 0.097410 0.108392 0.089304 0.092394 0.078022 0.088357 0.067091 0.086555 0.080538 0.084795
qa: -0.1474 -0.1374 -0.3870 0.6302 -0.2884 -0.3506 0.1489 -0.2892 -0.2967 -0.2801 -0.1319 -0.0310 0.0163 -0.2047 -0.2217 0.0875 0.0896 0.0999 0.0836 0.0898 0.0993 0.1009 0.0868 0.1038 0.1449 0.1116 0.0974 0.1084 0.0893 0.0924 0.0780 0.0884 0.0671 0.0866 0.0805 0.0848
va: 2.2284 2.3003 2.0648 5.4014 2.1237 2.0921 3.9294 3.9301 3.9265 3.8805 4.0053 3.9059 3.9105 3.9231 3.9000 1.0210 1.0111 1.0142 1.0062 1.0082 1.0138 1.0078 1.0071 1.0130 0.9964 1.0387 1.0037 0.9976 1.0120 0.9914 1.0107 1.0069 1.0226 1.0236 1.0121 1.0064
dispcorr: -0.018791715 hartree
energy: -2042.198608770858
dipole: 8.98704 -9.22713 -0.24009 -10.70316 10.30087 -0.40229 -4.68583 4.87995 0.19411
magnitude: 0.50711 au
magnitude: 1.28897 debye
