program: Gaussian 09
title: 000066755
version: EM64L-G09RevD.01
frameworkgroup: C1[X(C8H10O2)]
method: RPBEPBE
basis: SDD
operation: Freq
keyword: #pfreq=noraman
keyword: PBEPBE/SDD
title: #p freq=noraman PBEPBE/SDD
converged: YES YES NO NO
title: Mulliken charges:
elementType: O O C C C C C C C C H H H H H H H H H H
charge: -0.333180 -0.436193 0.253206 -0.230983 0.127595 -0.324157 -0.321380 -0.251033 -0.217195 -0.685620 0.212599 0.212068 0.242111 0.249413 0.223266 0.213111 0.231642 0.231486 0.226636 0.376606
chargesum: 0.00000
title: Mulliken charges with hydrogens summed into heavy atoms:
elementType: O O C C C C C C C C
charge: -0.333180 -0.059586 0.253206 0.193683 0.127595 -0.082046 -0.071967 -0.027767 0.009441 -0.009381
polarizability: 1.27362590e+02 3.88446823e+00 1.00398310e+02 -6.25090847e-02 2.67296841e-02 4.79176457e+01
1716.lowfreq: -15.7212 -8.6459 -0.0010 -0.0009 -0.0004 1.4195 58.5625 99.7641 131.4182
frequency: 58.5221 99.7559 131.4050 188.1433 246.9093 285.9991 294.7679 321.8147 442.1910 489.9696 499.3710 525.9740 554.5852 588.8828 709.3090 742.1621 746.3243 806.8854 820.1099 836.8159 907.7228 909.3673 958.7973 1027.1306 1040.0777 1096.9205 1116.7226 1138.1895 1165.4108 1181.3582 1188.4016 1254.2171 1258.5650 1309.0285 1370.6426 1399.4423 1409.9112 1454.5689 1463.2517 1476.6576 1485.3306 1495.8863 1601.8677 1620.1541 2959.7669 2996.3606 3017.6441 3094.2916 3104.2628 3134.9128 3148.7504 3162.8588 3175.9671 3508.9253
redmass: 3.9121 1.7587 3.6608 5.0386 1.1570 4.8880 4.8976 3.2357 3.0014 4.9091 1.1167 5.8171 3.8548 6.6145 4.2750 1.2287 4.5323 5.4138 1.1537 1.2979 1.3688 3.1895 1.2895 2.1058 2.8056 2.1379 2.1107 1.4363 1.1304 1.6037 2.1104 2.5253 1.1424 1.4866 1.3201 1.2801 4.5118 2.4157 1.0402 1.2443 1.4166 1.4832 7.1643 6.2878 1.0556 1.0362 1.1078 1.0989 1.1016 1.0850 1.0901 1.0951 1.0994 1.0644
irintensity: 1.2862 2.7423 0.2620 0.3563 1.0800 0.5715 4.8979 3.4772 12.0244 11.6394 134.7328 1.4900 3.1180 3.3371 0.2510 114.9994 21.8743 8.7075 1.0382 1.8261 3.8408 32.4945 0.1200 24.1208 60.6339 54.3171 9.9023 4.5719 19.4000 86.6494 173.4423 138.6964 0.1370 29.9351 9.6398 39.6454 20.0626 18.5574 12.4926 61.7248 72.7991 27.2057 24.7739 8.4766 37.1452 20.8421 33.5604 27.1712 35.8332 0.5350 19.8824 21.6777 9.5314 68.7968
temp: 298.150 k
press: 1.00000 atm
elementType: 8 8 6 6 6 6 6 6 6 6 1 1 1 1 1 1 1 1 1 1
symmnumber: 1
zpe: 424813.4 jmol-1
zpe.correction: 0.161803 hartree
zpe.thermalcorrener: 0.171428 hartree
zpe.thermalcorrenthalpy: 0.172372 hartree
zpe.thermalcorrgfe: 0.126840 hartree
zpe.sumelectzpe: -460.533277 hartree
zpe.sumelectthermal: -460.523652 hartree
zpe.sumelectthermalent: -460.522708 hartree
zpe.sumelectthermalfe: -460.568241 hartree
dipole: 2.6351 -2.3079 0.0149
dipole: 3.5029
quadrupole: -48.9785 -59.0469 -62.9894
quadrupole: 0.4808 0.0095 0.0141
quadrupole: 8.0264 -2.0420 -5.9844 0.4808 0.0095 0.0141
hfenergy: -460.6950803 hartree
pointgroup: C01 [X(C8H10O2)]
dipole: 0.9941421 0.9443462 -0.1385489 debye
dipolederiv: -1.848135 -0.1401196 0.0671368 -0.1528297 -0.3917514 0.0169041 0.0655148 0.0172721 -0.2903342 -0.4064523 0.4823867 -0.0509502 0.4676994 -1.1113472 0.0587818 -0.0495894 0.058485 -0.4123534 1.3546091 -0.1131117 -0.0308982 -0.0606062 -0.1988758 0.0282796 -0.0329956 0.0290166 0.0367736 0.9130115 0.1926848 -0.0386023 0.5327643 0.4042927 -0.0184699 -0.0765484 -0.0074777 0.4055415 0.0211359 -0.4346982 0.0472157 -0.613832 0.9931401 -0.0791232 0.0665912 -0.0846971 0.0592346 -0.0948794 -0.0441135 0.0021801 0.1208274 -0.0007495 -0.0229019 -0.0159874 -0.0166622 -0.1765263 0.0072734 0.2476395 -0.0315817 -0.0385762 -0.0480331 -0.0119696 -0.0017179 -0.0214162 -0.174698 -0.0878951 0.0319377 -0.0065193 -0.0835953 0.0106213 -0.0189118 0.0052536 -0.0228895 -0.194718 0.042235 -0.0784531 0.0015252 0.1209407 0.0265098 -0.025404 -0.0195799 -0.0191087 -0.17486 -0.1568784 0.0365023 0.0029441 0.0052412 0.0470903 0.001856 0.0062188 0.00059 0.0594882 -0.0313217 0.0367751 -0.0666843 -0.0921982 -0.0281975 0.0914617 -0.0055577 0.1085647 -0.1075029 -0.0260675 0.0419323 0.053466 -0.0951145 -0.0759408 -0.0933987 0.0229644 -0.1191991 -0.0653843 0.0121862 -0.1072454 0.0160208 -0.1118133 -0.0090703 0.0220018 0.0164297 0.0214672 0.1641141 0.0386342 -0.0736817 0.0118905 -0.0827714 -0.0189869 0.02255 0.0126463 0.0223754 0.1697173 0.0399356 0.0680634 -0.0030056 0.0852921 -0.0920051 0.0246521 -0.0047405 0.0254066 0.1674883 -0.0669012 -0.0970187 0.0167829 -0.1351191 -0.0316308 0.0204678 0.0210792 0.0191889 0.1135735 0.0953827 0.0093044 -0.0070768 0.0718022 0.044059 0.093391 -0.0464969 0.0965404 -0.0811618 0.0966613 0.0027754 -0.0043362 0.0724301 -0.0028188 -0.1161442 0.0208288 -0.114985 -0.036786 -0.1308471 0.0287906 0.0063062 0.0254108 0.0871943 0.0075548 0.0066644 0.0075344 0.1660114 0.2283128 -0.0903501 0.0141864 -0.0359523 0.3964997 -0.0015774 0.0090224 -0.0000058 0.3723823 unknown
polarizability: 127.5739939|-2.9105832|99.5552899|-2.2789576|-5.3196512|48.5492619 unknown
InChI: InChI=1S/C8H10O2/c1-2-10-8-6-4-3-5-7(8)9/h3-6,9H,2H2,1H3
charge 0 multiplicity 1
20 atoms
O  1.456439 -0.318207 -0.106543
O  -0.219051 -2.380615 0.161267
C  0.087023 0.029416 -0.100359
C  2.443569 0.765843 -0.263992
C  -0.770927 -1.099526 0.044632
C  -0.450287 1.325934 -0.219184
C  -2.165511 -0.924465 0.069702
C  -1.857662 1.496447 -0.192886
C  -2.708054 0.378065 -0.04962
C  3.827965 0.124122 -0.239178
H  2.255989 1.288329 -1.224199
H  2.319294 1.491892 0.565282
H  0.203295 2.19667 -0.330468
H  -2.804503 -1.805481 0.181454
H  -2.279835 2.502582 -0.284857
H  4.605581 0.901526 -0.349241
H  3.997145 -0.403988 0.714841
H  3.939936 -0.599047 -1.065095
H  -3.794562 0.51266 -0.029877
H  0.770958 -2.295456 0.119519
