program: Orca
programVersion: 5.0.2
elementType: S S S P O O C C C C C C C C C H H H H H H H H H H H H H H H H H H H H H
charge: 0
multiplicity: 1
keywords: wb97x-d3
keywords: def2-TZVPP
keywords: def2/J RIJCOSX
keywords: DEFGRID2
keywords: scfconv7
keywords: smallprint printgap noloewdin
keywords: NOSOSCF
formula: C9H21O2PS3
InChI: InChI=1/C9H21O2PS3/c1-6-10-12(13,11-7-2)15-8-14-9(3,4)5/h6-8H2,1-5H3
36 atoms
S  3.146592 0.404996 0.021764
S  0.391239 0.030047 -1.10131
S  -2.883694 -0.05573 -1.705811
P  -1.528317 0.52697 -0.482455
O  -1.662599 -0.014896 1.031752
O  -1.392422 2.099224 -0.208454
C  3.472497 -1.294958 0.651928
C  2.799483 -2.353532 -0.21194
C  4.992108 -1.41594 0.539042
C  3.047745 -1.431273 2.107722
C  1.394794 0.682351 0.290937
C  -2.216993 -1.300914 1.322348
C  -2.524356 2.975252 -0.290826
C  -1.301294 -2.445163 0.946432
C  -3.520087 2.763777 0.827522
H  3.093455 -3.350013 0.127725
H  1.712788 -2.29377 -0.160753
H  3.087374 -2.253376 -1.257998
H  5.502914 -0.673723 1.153603
H  5.328205 -1.294275 -0.491578
H  5.308035 -2.405021 0.875712
H  1.965164 -1.369985 2.228773
H  3.352281 -2.407182 2.492514
H  3.504274 -0.663173 2.731585
H  1.056618 0.25396 1.232071
H  1.261198 1.761366 0.341435
H  -2.398728 -1.289751 2.396882
H  -3.180475 -1.404227 0.817518
H  -2.100326 3.977884 -0.250424
H  -3.006067 2.850415 -1.263385
H  -1.733109 -3.381731 1.30052
H  -1.175456 -2.525325 -0.132545
H  -0.316026 -2.33965 1.401927
H  -4.285464 3.538976 0.778762
H  -4.02263 1.801083 0.739166
H  -3.042599 2.820499 1.804864
totalener: -2042.17963206 hartree
nucrepener: 1696.55248739 hartree
electener: -3738.73211944 hartree
oneelecener: -6187.68203047 hartree
twoeener: 2448.94991102 hartree
kineticenergy: 2037.00735595 hartree
xcener: -124.866469839387 hartree
chargesum: -0.0000000
charge: -0.110621 -0.105750 -0.384319 0.602123 -0.331177 -0.325521 0.144200 -0.292396 -0.274572 -0.310478 -0.175184 0.031729 0.007973 -0.247118 -0.222091 0.088683 0.069940 0.106574 0.103642 0.106523 0.084950 0.077632 0.092293 0.107285 0.119480 0.156433 0.095561 0.092290 0.093160 0.093309 0.094751 0.093378 0.066591 0.084766 0.079180 0.086785
qa: -0.1106 -0.1058 -0.3843 0.6021 -0.3312 -0.3255 0.1442 -0.2924 -0.2746 -0.3105 -0.1752 0.0317 0.0080 -0.2471 -0.2221 0.0887 0.0699 0.1066 0.1036 0.1065 0.0849 0.0776 0.0923 0.1073 0.1195 0.1564 0.0956 0.0923 0.0932 0.0933 0.0948 0.0934 0.0666 0.0848 0.0792 0.0868
va: 2.2802 2.3080 2.0709 5.4095 2.0593 2.1089 3.9391 3.9213 3.8613 3.9374 4.0670 3.8665 3.9115 3.9227 3.8745 1.0088 1.0196 1.0156 1.0143 1.0122 1.0064 1.0070 1.0062 1.0154 1.0183 1.0047 0.9897 1.0170 0.9914 1.0118 1.0182 1.0147 0.9998 1.0119 1.0250 1.0081
dispcorr: -0.018396534 hartree
energy: -2042.198028592547
dipole: 10.04479 -9.83211 0.21268 -10.77858 10.53879 -0.23979 16.33469 -14.83603 1.49867
magnitude: 1.53256 au
magnitude: 3.89546 debye
