program: Orca
programVersion: 5.0.2
elementType: S S S P O O C C C C C C C C C H H H H H H H H H H H H H H H H H H H H H
charge: 0
multiplicity: 1
keywords: wb97x-d3
keywords: def2-TZVPP
keywords: def2/J RIJCOSX
keywords: DEFGRID2
keywords: scfconv7
keywords: smallprint printgap noloewdin
keywords: NOSOSCF
formula: C9H21O2PS3
InChI: InChI=1/C9H21O2PS3/c1-6-10-12(13,11-7-2)15-8-14-9(3,4)5/h6-8H2,1-5H3
36 atoms
S  1.683272 -1.032184 1.138798
S  0.619605 0.918551 -1.022701
S  -2.544271 0.896164 -2.003109
P  -1.380461 0.767309 -0.4865
O  -1.496778 -0.567087 0.398686
O  -1.523827 1.870086 0.66434
C  3.27727 -1.540699 0.3702
C  3.373838 -3.030428 0.693879
C  3.264688 -1.334851 -1.138471
C  4.439138 -0.792812 1.012796
C  1.457292 0.664696 0.58953
C  -1.485199 -1.850693 -0.235739
C  -2.820614 2.328976 1.080793
C  -1.65701 -2.905999 0.827811
C  -3.095097 3.702409 0.517284
H  4.314122 -3.431036 0.310643
H  3.350719 -3.212388 1.76933
H  2.558933 -3.592122 0.236381
H  2.407442 -1.820027 -1.603482
H  4.174107 -1.754497 -1.575366
H  3.237067 -0.279849 -1.412755
H  5.387373 -1.138588 0.594178
H  4.385479 0.282195 0.834177
H  4.464942 -0.95221 2.09031
H  0.89946 1.187006 1.364291
H  2.417393 1.173515 0.500257
H  -2.2894 -1.895167 -0.974855
H  -0.534117 -1.985332 -0.758367
H  -3.59863 1.626891 0.77159
H  -2.799585 2.340679 2.170793
H  -2.599181 -2.783686 1.361237
H  -1.660355 -3.892302 0.363563
H  -0.840685 -2.872277 1.547801
H  -3.142566 3.671134 -0.570169
H  -4.051949 4.070237 0.888912
H  -2.323407 4.412464 0.812778
totalener: -2042.18204975 hartree
nucrepener: 1707.11698658 hartree
electener: -3749.29903633 hartree
oneelecener: -6209.04308438 hartree
twoeener: 2459.74404805 hartree
kineticenergy: 2037.00567934 hartree
xcener: -124.864131223490 hartree
chargesum: -0.0000000
charge: -0.123970 -0.121602 -0.388611 0.617130 -0.314747 -0.331985 0.146709 -0.277448 -0.304538 -0.294740 -0.173344 -0.007982 0.019491 -0.223157 -0.213796 0.086470 0.104011 0.100798 0.106973 0.093939 0.080564 0.089151 0.086830 0.099996 0.154109 0.129204 0.114255 0.085363 0.080993 0.091344 0.085555 0.074687 0.083052 0.086894 0.077050 0.081352
qa: -0.1240 -0.1216 -0.3886 0.6171 -0.3147 -0.3320 0.1467 -0.2774 -0.3045 -0.2947 -0.1733 -0.0080 0.0195 -0.2232 -0.2138 0.0865 0.1040 0.1008 0.1070 0.0939 0.0806 0.0892 0.0868 0.1000 0.1541 0.1292 0.1143 0.0854 0.0810 0.0913 0.0856 0.0747 0.0831 0.0869 0.0770 0.0814
va: 2.2579 2.3013 2.0718 5.4307 2.0810 2.0962 3.9049 3.8803 3.9469 3.9346 4.0334 3.8628 3.9122 3.9353 3.9150 1.0076 1.0107 1.0129 1.0086 1.0098 1.0021 1.0061 1.0087 1.0152 1.0199 1.0135 1.0156 1.0047 1.0126 0.9960 1.0080 1.0077 1.0143 1.0219 1.0111 1.0062
dispcorr: -0.017713505 hartree
energy: -2042.199763254607
dipole: 14.35145 -13.43931 0.91214 -10.96811 10.56394 -0.40416 9.01933 -8.05741 0.96192
magnitude: 1.38587 au
magnitude: 3.52260 debye
