program: Orca
programVersion: 5.0.2
elementType: S S S P O O C C C C C C C C C H H H H H H H H H H H H H H H H H H H H H
charge: 0
multiplicity: 1
keywords: wb97x-d3
keywords: def2-TZVPP
keywords: def2/J RIJCOSX
keywords: DEFGRID2
keywords: scfconv7
keywords: smallprint printgap noloewdin
keywords: NOSOSCF
formula: C9H21O2PS3
InChI: InChI=1/C9H21O2PS3/c1-6-10-12(13,11-7-2)15-8-14-9(3,4)5/h6-8H2,1-5H3
36 atoms
S  1.766668 -0.775827 1.160102
S  0.527772 0.5791 -1.333025
S  -2.732052 0.404391 -1.935969
P  -1.404406 0.667348 -0.581655
O  -1.44178 -0.34855 0.661445
O  -1.398603 2.062914 0.20326
C  3.278255 -1.529601 0.428581
C  4.504452 -0.686052 0.757391
C  3.377694 -2.886566 1.122621
C  3.136069 -1.720392 -1.075236
C  1.523589 0.724052 0.199961
C  -1.559508 -1.759119 0.447098
C  -2.62326 2.599429 0.732477
C  -1.608855 -2.436871 1.794197
C  -3.088143 3.766444 -0.105987
H  4.621214 -0.558215 1.83299
H  5.406736 -1.166583 0.371187
H  4.455193 0.305951 0.305559
H  2.514994 -3.514224 0.897828
H  3.449386 -2.781507 2.206196
H  4.272196 -3.41071 0.78073
H  3.997923 -2.271185 -1.460212
H  2.234475 -2.277548 -1.32672
H  3.099496 -0.771466 -1.611286
H  1.063491 1.462993 0.85302
H  2.481178 1.139356 -0.11488
H  -2.462116 -1.961727 -0.134855
H  -0.697341 -2.109919 -0.12672
H  -3.398503 1.830332 0.778587
H  -2.402816 2.905419 1.755771
H  -1.717133 -3.512845 1.657473
H  -0.693468 -2.257309 2.356335
H  -2.455167 -2.087711 2.385064
H  -2.323694 4.540642 -0.164644
H  -3.33449 3.442235 -1.116138
H  -3.981121 4.207492 0.338148
totalener: -2042.18206876 hartree
nucrepener: 1707.26739834 hartree
electener: -3749.44946710 hartree
oneelecener: -6209.34063228 hartree
twoeener: 2459.89116518 hartree
kineticenergy: 2037.00402044 hartree
xcener: -124.863438540161 hartree
chargesum: 0.0000000
charge: -0.126524 -0.119963 -0.386421 0.613030 -0.316892 -0.331196 0.149283 -0.295328 -0.279331 -0.304181 -0.170072 -0.007770 0.020779 -0.223352 -0.213249 0.099605 0.089498 0.086834 0.101196 0.103808 0.087322 0.094422 0.107290 0.079457 0.153587 0.127523 0.112784 0.088323 0.080840 0.089863 0.075438 0.083238 0.085343 0.081761 0.086429 0.076629
qa: -0.1265 -0.1200 -0.3864 0.6130 -0.3169 -0.3312 0.1493 -0.2953 -0.2793 -0.3042 -0.1701 -0.0078 0.0208 -0.2234 -0.2132 0.0996 0.0895 0.0868 0.1012 0.1038 0.0873 0.0944 0.1073 0.0795 0.1536 0.1275 0.1128 0.0883 0.0808 0.0899 0.0754 0.0832 0.0853 0.0818 0.0864 0.0766
va: 2.2588 2.3041 2.0776 5.4371 2.0720 2.0925 3.9035 3.9358 3.8803 3.9454 4.0337 3.8612 3.9186 3.9352 3.9172 1.0154 1.0060 1.0085 1.0130 1.0106 1.0072 1.0094 1.0098 1.0023 1.0201 1.0149 1.0166 1.0050 1.0099 0.9959 1.0077 1.0144 1.0077 1.0062 1.0218 1.0108
dispcorr: -0.017734755 hartree
energy: -2042.199803517339
dipole: 14.83144 -13.82739 1.00405 -8.78887 8.59608 -0.19279 11.03325 -10.01715 1.01610
magnitude: 1.44143 au
magnitude: 3.66383 debye
