program: Orca
programVersion: 5.0.2
elementType: S S S P O O C C C C C C C C C H H H H H H H H H H H H H H H H H H H H H
charge: 0
multiplicity: 1
keywords: wb97x-d3
keywords: def2-TZVPP
keywords: def2/J RIJCOSX
keywords: DEFGRID2
keywords: scfconv7
keywords: smallprint printgap noloewdin
keywords: NOSOSCF
formula: C9H21O2PS3
InChI: InChI=1/C9H21O2PS3/c1-6-10-12(13,11-7-2)15-8-14-9(3,4)5/h6-8H2,1-5H3
36 atoms
S  1.960534 0.428281 1.17523
S  0.120876 -1.077647 -0.791906
S  -2.593882 0.174935 -2.114977
P  -1.625204 0.019021 -0.471768
O  -2.343668 -0.669229 0.783768
O  -1.182443 1.355145 0.283136
C  3.60425 -0.076003 0.517921
C  3.514804 -0.545526 -0.927931
C  4.436468 1.201918 0.600671
C  4.217788 -1.155194 1.402047
C  0.912708 -0.99722 0.858876
C  -3.091567 -1.878529 0.600461
C  -0.538225 2.397417 -0.463399
C  -4.573555 -1.589783 0.584572
C  -0.204522 3.519876 0.486303
H  4.520033 -0.72269 -1.318213
H  2.965909 -1.482458 -1.027291
H  3.027662 0.193855 -1.562263
H  4.489679 1.584395 1.621091
H  4.027475 1.986746 -0.036174
H  5.456756 0.998664 0.269865
H  4.313903 -0.816372 2.433063
H  3.624701 -2.071068 1.403955
H  5.212824 -1.420706 1.036635
H  1.47689 -1.923413 0.968865
H  0.140893 -1.008135 1.627125
H  -2.787331 -2.387862 -0.318301
H  -2.825006 -2.526097 1.436541
H  0.371619 2.004506 -0.925389
H  -1.207119 2.73428 -1.258992
H  -4.839888 -0.971183 -0.270932
H  -5.128976 -2.525614 0.514945
H  -4.885398 -1.080112 1.495652
H  0.4860 3.187338 1.259955
H  0.271811 4.330068 -0.066061
H  -1.099431 3.918771 0.962678
totalener: -2042.18308693 hartree
nucrepener: 1706.49577085 hartree
electener: -3748.67885778 hartree
oneelecener: -6207.69680393 hartree
twoeener: 2459.01794615 hartree
kineticenergy: 2037.00892551 hartree
xcener: -124.865328017767 hartree
chargesum: -0.0000000
charge: -0.127121 -0.138800 -0.381889 0.599803 -0.319657 -0.308556 0.151186 -0.306799 -0.278457 -0.294040 -0.164252 0.024324 -0.014811 -0.218115 -0.222736 0.095025 0.079431 0.107911 0.103359 0.102127 0.086406 0.099924 0.085488 0.089304 0.132044 0.147202 0.082230 0.089070 0.089582 0.116311 0.086217 0.077100 0.084482 0.083220 0.074355 0.089133
qa: -0.1271 -0.1388 -0.3819 0.5998 -0.3197 -0.3086 0.1512 -0.3068 -0.2785 -0.2940 -0.1643 0.0243 -0.0148 -0.2181 -0.2227 0.0950 0.0794 0.1079 0.1034 0.1021 0.0864 0.0999 0.0855 0.0893 0.1320 0.1472 0.0822 0.0891 0.0896 0.1163 0.0862 0.0771 0.0845 0.0832 0.0744 0.0891
va: 2.2604 2.2888 2.0825 5.4750 2.1055 2.1238 3.9032 3.9413 3.8817 3.9385 4.0261 3.8959 3.8514 3.9318 3.9411 1.0098 1.0028 1.0105 1.0108 1.0132 1.0072 1.0151 1.0093 1.0059 1.0115 1.0208 1.0119 0.9920 1.0062 1.0134 1.0237 1.0103 1.0058 1.0142 1.0071 1.0070
dispcorr: -0.017721116 hartree
energy: -2042.200808043724
dipole: 18.32901 -17.19991 1.12910 1.30704 -1.75200 -0.44497 8.27588 -7.47668 0.79919
magnitude: 1.45312 au
magnitude: 3.69355 debye
