program: Gaussian 09
title: 000066754
version: EM64L-G09RevD.01
frameworkgroup: C1[X(C8H10ClN)]
method: RPBEPBE
basis: SDD
operation: Freq
keyword: #p
keyword: freq=noraman
keyword: PBEPBE/SDD
title: #p freq=noraman PBEPBE/SDD
converged: YES YES NO NO
title: Mulliken charges:
elementType: Cl N C C C C C C C C H H H H H H H H H H
charge: -0.075683 -0.329099 -0.459041 0.499441 -0.309213 -0.387210 -0.230763 -0.230408 -0.228240 -0.624899 0.235167 0.221432 0.289802 0.263758 0.254506 0.229774 0.233075 0.229079 0.223476 0.195044
chargesum: 0.00000
title: Mulliken charges with hydrogens summed into heavy atoms:
elementType: Cl N C C C C C C C C
charge: -0.075683 -0.065340 -0.002442 0.499441 -0.309213 -0.097408 0.023743 -0.000633 0.004836 0.022700
polarizability: 1.23579861e+02 -5.50412152e+00 1.19758081e+02 -2.36936325e+00 4.68469960e-01 5.24242157e+01
1716.lowfreq: -7.7689 -0.0025 -0.0020 0.0007 4.4557 9.2722 58.1559 84.2147 123.2940
frequency: 58.0127 84.1840 123.2921 156.4992 220.3768 236.5819 256.6582 311.1443 391.2321 429.1310 443.9499 509.8870 591.9788 670.3211 686.1890 711.1751 762.2485 805.9915 873.2520 944.8134 959.2932 978.5425 1005.2768 1012.4633 1035.7299 1106.3451 1115.1970 1135.4349 1166.7561 1168.6922 1208.7626 1239.6966 1267.8850 1341.9792 1384.5699 1424.1153 1437.4917 1449.6823 1456.2663 1468.1643 1476.3594 1495.1713 1573.5206 1607.4032 2881.1717 2897.0433 2982.2328 3016.9557 3079.1722 3132.3543 3146.6260 3159.1524 3173.9818 3449.3143
redmass: 2.6282 2.2315 2.9958 4.1421 3.3402 1.4084 4.0727 3.3375 7.8735 4.1078 3.5117 3.6458 5.5091 3.7572 1.6878 2.9373 1.2390 3.8705 1.2876 1.5307 2.1418 1.4144 1.3901 5.7929 2.0022 1.5351 1.5232 1.8038 1.0703 2.5141 2.0926 1.3812 1.4681 1.8519 3.3699 2.0843 1.1688 1.2058 2.2032 1.0882 1.1504 1.0481 6.2642 7.1705 1.0558 1.0689 1.0878 1.0764 1.0995 1.0856 1.0904 1.0956 1.0991 1.0746
irintensity: 1.0057 4.0037 2.5496 0.2038 0.1803 5.2476 1.6589 1.0896 7.8367 4.7556 10.1311 0.3038 0.9012 1.6453 114.6497 17.2906 87.2237 1.8958 1.0868 3.6613 7.6849 10.0286 6.2403 49.0414 9.3084 1.8574 4.5607 18.7468 3.7182 28.2455 5.0699 6.5917 2.2764 6.6535 10.1156 20.4575 5.5889 20.7417 47.1399 10.0156 3.6428 15.1558 13.3060 0.5544 136.1964 59.2068 21.0202 44.3409 37.1938 3.3416 3.2629 16.6519 15.4237 0.3239
temp: 298.150 k
press: 1.00000 atm
elementType: 17 7 6 6 6 6 6 6 6 6 1 1 1 1 1 1 1 1 1 1
symmnumber: 1
zpe: 422878.2 jmol-1
zpe.correction: 0.161066 hartree
zpe.thermalcorrener: 0.171000 hartree
zpe.thermalcorrenthalpy: 0.171944 hartree
zpe.thermalcorrgfe: 0.124966 hartree
zpe.sumelectzpe: -824.900246 hartree
zpe.sumelectthermal: -824.890312 hartree
zpe.sumelectthermalent: -824.889368 hartree
zpe.sumelectthermalfe: -824.936346 hartree
dipole: -0.8398 -1.1596 -0.6424
dipole: 1.5693
quadrupole: -56.8545 -66.8805 -68.3788
quadrupole: -3.7649 1.3321 1.2352
quadrupole: 7.1834 -2.8426 -4.3409 -3.7649 1.3321 1.2352
hfenergy: -825.0613122 hartree
pointgroup: C01 [X(C8H10Cl1N1)]
dipole: -0.210439 0.4135704 0.4072612 debye
dipolederiv: -0.2060282 -0.1585664 -0.0654772 -0.146386 -0.6880408 -0.2152725 -0.0526335 -0.2137811 -0.1606994 -0.8066848 -0.0040042 0.0100245 0.0045746 -0.5453475 -0.0653576 0.0494315 -0.055229 -0.1839763 0.3251887 -0.1508218 -0.1337096 -0.1372428 0.3952433 -0.0147469 -0.340683 0.0671529 0.2482808 0.1480046 -0.0228285 0.0445132 0.0476906 -0.3010993 -0.0983138 0.1408622 -0.1043178 -0.0120259 0.1095939 0.25619 0.1075173 0.2029528 0.9511903 0.375687 0.0968282 0.3740325 0.0495218 -0.1183299 0.0210363 0.0274778 -0.0848997 0.0057425 0.0342578 -0.0386103 0.0383675 -0.148368 -0.0863382 -0.1045955 -0.0250596 -0.1053025 -0.1894998 -0.0421618 -0.0384582 -0.0414171 -0.1250901 -0.0397122 0.041159 0.0214025 0.058755 0.0703649 0.0771318 0.0342298 0.0766492 -0.1343875 0.0597774 -0.0241321 0.0150128 0.0320211 -0.0060478 0.0530756 0.0343452 0.0524079 -0.1462197 0.6009284 0.0770205 0.0454889 0.0601936 0.2998264 -0.0348398 0.1848027 -0.0610483 0.1725365 -0.0212065 0.0091586 -0.0655901 0.0490398 0.065604 0.030045 -0.0318038 0.0017047 -0.1095944 -0.0418831 -0.025973 0.0222838 0.0103546 -0.1903822 0.0112647 0.0537174 0.0330382 0.0512326 0.1423986 0.0607946 0.0094037 0.0832381 0.0144483 -0.0367151 0.00567 -0.0387291 0.1406329 0.1498928 0.0499359 -0.019115 0.1170127 0.2240154 0.0847061 -0.03426 0.0088224 -0.0089227 0.0329697 0.0667465 0.0103061 0.0850789 0.0146832 -0.0397908 0.0141569 -0.0442291 0.1527939 0.0511226 -0.058974 -0.0267495 -0.0760659 -0.07263 -0.0792235 -0.0298227 -0.0802826 0.1336435 -0.1178211 -0.0310086 -0.0351857 -0.0262702 0.0780306 -0.030567 -0.0395385 -0.0303153 0.1506164 0.0467378 -0.0074372 0.0128347 -0.0262562 0.0733616 0.0624627 -0.0909951 0.0843761 -0.1578822 -0.0460389 0.0763638 0.0451835 0.1137008 -0.021187 -0.1078666 0.1140887 -0.1085189 0.0241905 -0.1825715 -0.0700639 -0.0005621 -0.2621892 -0.1782761 0.0362247 -0.0313276 0.041317 0.0637173 unknown
polarizability: 125.7800383|1.8130407|109.9863614|6.2549537|20.4034798|59.995758 unknown
InChI: InChI=1S/C8H10ClN/c1-10-6-7-4-2-3-5-8(7)9/h2-5,10H,6H2,1H3
charge 0 multiplicity 1
20 atoms
Cl 0.308996 -2.704052 -1.008006
N  -2.382806 0.746937 0.35215
C  -1.571921 -0.241992 -0.384593
C  -0.075845 -0.037687 -0.170257
C  0.873334 -1.058356 -0.410773
C  0.431557 1.212885 0.270498
C  2.25778 -0.880163 -0.22778
C  1.814145 1.422216 0.464018
C  2.731173 0.375066 0.217385
C  -3.812252 0.752367 -0.009871
H  -1.799371 -0.121278 -1.464199
H  -1.833845 -1.299023 -0.140863
H  -0.298745 2.01004 0.44443
H  -2.239568 0.668872 1.367827
H  2.94836 -1.704117 -0.429237
H  2.175104 2.399166 0.803479
H  3.805755 0.526043 0.365714
H  -3.923517 1.055941 -1.067426
H  -4.346259 1.495381 0.608134
H  -4.325376 -0.232645 0.112369
