program: Orca
programVersion: 5.0.2
elementType: S S S P O O C C C C C C C C C H H H H H H H H H H H H H H H H H H H H H
charge: 0
multiplicity: 1
keywords: wb97x-d3
keywords: def2-TZVPP
keywords: def2/J RIJCOSX
keywords: DEFGRID2
keywords: scfconv7
keywords: smallprint printgap noloewdin
keywords: NOSOSCF
formula: C9H21O2PS3
InChI: InChI=1/C9H21O2PS3/c1-6-10-12(13,11-7-2)15-8-14-9(3,4)5/h6-8H2,1-5H3
36 atoms
S  1.601648 -1.543871 0.944425
S  -0.087044 0.666958 2.058849
S  0.074503 2.442515 -0.859144
P  -0.921636 1.204071 0.213146
O  -1.239506 -0.13599 -0.59853
O  -2.323664 1.701671 0.818698
C  2.905835 -1.538332 -0.35476
C  2.458908 -0.730087 -1.566211
C  4.221786 -1.013854 0.206066
C  3.050663 -3.011184 -0.730808
C  1.569706 0.178347 1.499832
C  -1.943514 -1.247305 -0.030603
C  -3.090791 2.733767 0.185476
C  -1.711166 -2.453437 -0.905891
C  -3.764639 2.253892 -1.08019
H  3.225288 -0.771483 -2.344075
H  1.53016 -1.119931 -1.980067
H  2.290832 0.321296 -1.334035
H  5.008985 -1.095073 -0.547376
H  4.53332 -1.580902 1.083193
H  4.157181 0.03787 0.487807
H  2.112505 -3.424438 -1.104017
H  3.795051 -3.117337 -1.52222
H  3.37494 -3.614005 0.117838
H  2.218913 0.326119 2.362143
H  1.889399 0.864763 0.713721
H  -1.581375 -1.440362 0.982235
H  -3.007201 -1.003797 0.031287
H  -3.825904 3.034046 0.931159
H  -2.446263 3.590963 -0.021377
H  -0.652557 -2.708526 -0.930812
H  -2.25612 -3.306788 -0.50183
H  -2.056974 -2.284105 -1.92514
H  -3.035706 2.007929 -1.852082
H  -4.386301 1.378257 -0.893564
H  -4.406729 3.042682 -1.472971
totalener: -2042.18019647 hartree
nucrepener: 1733.84437729 hartree
electener: -3776.02457376 hartree
oneelecener: -6262.55762985 hartree
twoeener: 2486.53305608 hartree
kineticenergy: 2037.00711656 hartree
xcener: -124.865228590963 hartree
chargesum: -0.0000000
charge: -0.144661 -0.128028 -0.385407 0.612965 -0.287180 -0.341783 0.140299 -0.279710 -0.298058 -0.279291 -0.136689 -0.023748 0.014606 -0.201581 -0.239173 0.089228 0.096590 0.085822 0.089908 0.100235 0.085358 0.100315 0.086858 0.103941 0.144830 0.109741 0.102907 0.098866 0.095275 0.095480 0.062712 0.080089 0.088516 0.094304 0.078296 0.088169
qa: -0.1447 -0.1280 -0.3854 0.6130 -0.2872 -0.3418 0.1403 -0.2797 -0.2981 -0.2793 -0.1367 -0.0237 0.0146 -0.2016 -0.2392 0.0892 0.0966 0.0858 0.0899 0.1002 0.0854 0.1003 0.0869 0.1039 0.1448 0.1097 0.1029 0.0989 0.0953 0.0955 0.0627 0.0801 0.0885 0.0943 0.0783 0.0882
va: 2.2284 2.3088 2.0752 5.4048 2.0879 2.0929 3.9421 3.9294 3.9235 3.8817 4.0058 3.8940 3.9027 3.9148 3.8913 1.0105 1.0123 1.0261 1.0083 1.0135 1.0052 1.0070 1.0069 1.0129 0.9972 1.0408 1.0078 0.9984 0.9911 1.0133 1.0284 1.0117 1.0063 1.0190 1.0058 1.0133
dispcorr: -0.019260259 hartree
energy: -2042.199456729883
dipole: 5.74397 -6.11334 -0.36938 -14.12356 13.54599 -0.57757 -11.69023 11.60408 -0.08615
magnitude: 0.69097 au
magnitude: 1.75631 debye
