program: Orca
programVersion: 5.0.2
elementType: S S S P O O C C C C C C C C C H H H H H H H H H H H H H H H H H H H H H
charge: 0
multiplicity: 1
keywords: wb97x-d3
keywords: def2-TZVPP
keywords: def2/J RIJCOSX
keywords: DEFGRID2
keywords: scfconv7
keywords: smallprint printgap noloewdin
keywords: NOSOSCF
formula: C9H21O2PS3
InChI: InChI=1/C9H21O2PS3/c1-6-10-12(13,11-7-2)15-8-14-9(3,4)5/h6-8H2,1-5H3
36 atoms
S  1.580147 -1.565439 0.459228
S  -0.363878 0.327388 1.642953
S  -0.155157 1.474452 -1.551405
P  -1.317876 0.78671 -0.185494
O  -2.238175 -0.454766 -0.562331
O  -2.495397 1.727464 0.343175
C  3.190441 -1.451517 -0.424977
C  3.465711 -2.883934 -0.876224
C  3.080082 -0.535955 -1.636905
C  4.284308 -0.978556 0.524876
C  1.35326 0.101603 1.121567
C  -1.71768 -1.611905 -1.233788
C  -2.236419 3.086258 0.705791
C  -1.919967 -2.833942 -0.371186
C  -3.562247 3.77631 0.917583
H  3.540789 -3.565995 -0.028695
H  2.682743 -3.251181 -1.541302
H  4.409569 -2.922123 -1.423568
H  2.85994 0.495285 -1.361718
H  2.292037 -0.864347 -2.313195
H  4.024916 -0.532858 -2.186419
H  4.116979 0.044873 0.864056
H  4.353067 -1.620615 1.40307
H  5.25208 -0.992477 0.017746
H  1.951458 0.260754 2.01867
H  1.599919 0.86538 0.383287
H  -2.261611 -1.695773 -2.175438
H  -0.659687 -1.479404 -1.470671
H  -1.633527 3.110196 1.618303
H  -1.663602 3.575827 -0.086141
H  -1.566333 -3.717605 -0.903144
H  -1.357066 -2.755639 0.558052
H  -2.972018 -2.983973 -0.130422
H  -4.159187 3.773261 0.006429
H  -4.138551 3.298795 1.709245
H  -3.391273 4.813719 1.204678
totalener: -2042.18195695 hartree
nucrepener: 1713.49430826 hartree
electener: -3755.67626521 hartree
oneelecener: -6221.85204837 hartree
twoeener: 2466.17578316 hartree
kineticenergy: 2037.00715843 hartree
xcener: -124.867337110442 hartree
chargesum: -0.0000000
charge: -0.151509 -0.155397 -0.401046 0.629444 -0.298743 -0.311096 0.161949 -0.274741 -0.295847 -0.304787 -0.133579 0.025391 0.023557 -0.213921 -0.231809 0.103483 0.099806 0.085842 0.089124 0.098811 0.092038 0.083545 0.102549 0.090602 0.134722 0.120125 0.100510 0.061340 0.084169 0.092612 0.078140 0.074475 0.091999 0.087633 0.086059 0.074550
qa: -0.1515 -0.1554 -0.4010 0.6294 -0.2987 -0.3111 0.1619 -0.2747 -0.2958 -0.3048 -0.1336 0.0254 0.0236 -0.2139 -0.2318 0.1035 0.0998 0.0858 0.0891 0.0988 0.0920 0.0835 0.1025 0.0906 0.1347 0.1201 0.1005 0.0613 0.0842 0.0926 0.0781 0.0745 0.0920 0.0876 0.0861 0.0746
va: 2.2419 2.3026 2.0484 5.4476 2.1511 2.1542 3.9114 3.8755 3.9543 3.9241 4.0041 3.8779 3.8660 3.9287 3.9667 1.0131 1.0125 1.0073 1.0080 1.0104 1.0097 1.0051 1.0129 1.0082 0.9989 1.0408 0.9962 1.0300 0.9988 1.0060 1.0106 1.0193 1.0074 1.0069 1.0054 1.0074
dispcorr: -0.017825727 hartree
energy: -2042.199782677481
dipole: 13.39536 -12.77975 0.61561 -6.85152 6.82041 -0.03112 -2.75419 2.99595 0.24176
magnitude: 0.66211 au
magnitude: 1.68295 debye
