program: Orca
programVersion: 5.0.2
elementType: S S S P O O C C C C C C C C C H H H H H H H H H H H H H H H H H H H H H
charge: 0
multiplicity: 1
keywords: wb97x-d3
keywords: def2-TZVPP
keywords: def2/J RIJCOSX
keywords: DEFGRID2
keywords: scfconv7
keywords: smallprint printgap noloewdin
keywords: NOSOSCF
formula: C9H21O2PS3
InChI: InChI=1/C9H21O2PS3/c1-6-10-12(13,11-7-2)15-8-14-9(3,4)5/h6-8H2,1-5H3
36 atoms
S  1.718371 -1.465595 0.618532
S  0.122877 0.657648 1.934043
S  -0.58525 1.124443 -1.387526
P  -1.218752 0.531686 0.33326
O  -1.838769 -0.945394 0.351026
O  -2.373264 1.380194 1.042908
C  3.109601 -1.538764 -0.585469
C  3.268647 -3.028933 -0.877709
C  2.763179 -0.788901 -1.865339
C  4.385854 -0.990854 0.041441
C  1.660496 0.286627 1.056303
C  -1.68547 -1.889138 -0.71457
C  -3.54997 1.751887 0.309973
C  -2.834171 -1.793212 -1.691796
C  -3.458247 3.185005 -0.159985
H  4.080667 -3.180344 -1.591837
H  3.506544 -3.592864 0.025082
H  2.361619 -3.450682 -1.313701
H  2.611963 0.277095 -1.696814
H  1.852196 -1.176551 -2.319328
H  3.577156 -0.891487 -2.587584
H  4.626997 -1.508487 0.969949
H  5.22542 -1.119349 -0.646036
H  4.311283 0.076043 0.256647
H  2.456442 0.556146 1.75106
H  1.725827 0.923938 0.173773
H  -0.729378 -1.739224 -1.218305
H  -1.6558 -2.866357 -0.233141
H  -3.710804 1.080516 -0.538059
H  -4.384612 1.612469 0.996796
H  -2.828135 -0.833249 -2.207869
H  -2.742692 -2.575545 -2.446248
H  -3.794767 -1.921168 -1.192565
H  -4.387892 3.46963 -0.654038
H  -3.299159 3.865028 0.676017
H  -2.643131 3.311343 -0.87064
totalener: -2042.17949203 hartree
nucrepener: 1725.85757466 hartree
electener: -3768.03706670 hartree
oneelecener: -6246.70087834 hartree
twoeener: 2478.66381164 hartree
kineticenergy: 2037.00908215 hartree
xcener: -124.868123181969 hartree
chargesum: -0.0000000
charge: -0.134363 -0.115277 -0.416636 0.632641 -0.317553 -0.323831 0.151820 -0.275979 -0.299839 -0.305041 -0.157144 0.075421 0.022202 -0.256100 -0.222019 0.085400 0.104368 0.098461 0.089527 0.098037 0.092739 0.103430 0.089893 0.083913 0.136751 0.127890 0.058018 0.099480 0.072323 0.093977 0.079369 0.086730 0.090721 0.076898 0.086802 0.086971
qa: -0.1344 -0.1153 -0.4166 0.6326 -0.3176 -0.3238 0.1518 -0.2760 -0.2998 -0.3050 -0.1571 0.0754 0.0222 -0.2561 -0.2220 0.0854 0.1044 0.0985 0.0895 0.0980 0.0927 0.1034 0.0899 0.0839 0.1368 0.1279 0.0580 0.0995 0.0723 0.0940 0.0794 0.0867 0.0907 0.0769 0.0868 0.0870
va: 2.2276 2.3246 2.0058 5.4105 2.1030 2.1293 3.9054 3.8777 3.9602 3.9234 4.0242 3.8394 3.9455 3.9333 3.9158 1.0073 1.0129 1.0115 1.0093 1.0064 1.0093 1.0122 1.0084 1.0043 0.9987 1.0274 1.0279 0.9935 0.9957 0.9944 1.0183 1.0154 1.0018 1.0105 1.0060 1.0231
dispcorr: -0.018293776 hartree
energy: -2042.197785808974
dipole: 7.72506 -7.64889 0.07617 -7.35720 7.00256 -0.35464 -14.15522 13.68010 -0.47512
magnitude: 0.59775 au
magnitude: 1.51937 debye
