program: Orca
programVersion: 5.0.2
elementType: S S S P O O C C C C C C C C C H H H H H H H H H H H H H H H H H H H H H
charge: 0
multiplicity: 1
keywords: wb97x-d3
keywords: def2-TZVPP
keywords: def2/J RIJCOSX
keywords: DEFGRID2
keywords: scfconv7
keywords: smallprint printgap noloewdin
keywords: NOSOSCF
formula: C9H21O2PS3
InChI: InChI=1/C9H21O2PS3/c1-6-10-12(13,11-7-2)15-8-14-9(3,4)5/h6-8H2,1-5H3
36 atoms
S  2.5718 -1.756964 0.487022
S  0.04388 -0.329976 1.230927
S  -0.479104 1.592441 -1.558522
P  -1.222603 0.817412 0.033097
O  -2.500841 -0.088134 -0.322213
O  -1.710656 1.818182 1.189231
C  3.638528 -0.342564 -0.023066
C  3.696898 -0.243378 -1.542161
C  3.16663 0.972321 0.583097
C  5.010248 -0.718074 0.534125
C  0.931294 -1.282454 -0.061848
C  -3.20529 -0.834923 0.675737
C  -2.140357 3.155592 0.909745
C  -4.52007 -1.28612 0.087458
C  -3.514317 3.200059 0.279931
H  4.398711 0.541127 -1.83526
H  4.026745 -1.179676 -1.991349
H  2.730517 0.022646 -1.972391
H  3.893907 1.756101 0.356229
H  3.068257 0.902663 1.665809
H  2.207783 1.293195 0.176161
H  5.365725 -1.668215 0.132334
H  5.737451 0.049405 0.262903
H  4.993782 -0.792546 1.622004
H  0.96849 -0.691473 -0.97787
H  0.382851 -2.198909 -0.270429
H  -2.597872 -1.690799 0.981148
H  -3.375868 -0.221872 1.564635
H  -2.137348 3.657571 1.876728
H  -1.404727 3.647782 0.269695
H  -4.368653 -1.904604 -0.796285
H  -5.064685 -1.877816 0.823427
H  -5.143334 -0.43688 -0.190363
H  -3.837077 4.237002 0.183248
H  -3.511874 2.760073 -0.717013
H  -4.24978 2.67732 0.891575
totalener: -2042.18075346 hartree
nucrepener: 1688.33501044 hartree
electener: -3730.51576391 hartree
oneelecener: -6171.46046156 hartree
twoeener: 2440.94469766 hartree
kineticenergy: 2037.00251249 hartree
xcener: -124.862973401512 hartree
chargesum: -0.0000000
charge: -0.121133 -0.134010 -0.387515 0.616024 -0.306005 -0.336676 0.141035 -0.297982 -0.284007 -0.276159 -0.138965 -0.004982 0.016651 -0.225566 -0.238380 0.086154 0.097364 0.097006 0.086836 0.098963 0.076545 0.101090 0.083843 0.104449 0.105904 0.142016 0.096124 0.100083 0.096332 0.094283 0.088433 0.076810 0.082336 0.090214 0.094919 0.077968
qa: -0.1211 -0.1340 -0.3875 0.6160 -0.3060 -0.3367 0.1410 -0.2980 -0.2840 -0.2762 -0.1390 -0.0050 0.0167 -0.2256 -0.2384 0.0862 0.0974 0.0970 0.0868 0.0990 0.0765 0.1011 0.0838 0.1044 0.1059 0.1420 0.0961 0.1001 0.0963 0.0943 0.0884 0.0768 0.0823 0.0902 0.0949 0.0780
va: 2.2601 2.2970 2.0591 5.3973 2.1013 2.0884 3.9446 3.9420 3.9032 3.8685 4.0048 3.8877 3.8952 3.9594 3.8933 1.0064 1.0151 1.0071 1.0113 1.0152 1.0359 1.0128 1.0071 1.0132 1.0609 1.0015 0.9991 0.9942 0.9907 1.0148 1.0055 1.0072 1.0068 1.0135 1.0180 1.0053
dispcorr: -0.017640102 hartree
energy: -2042.198393564950
dipole: 2.78295 -3.50040 -0.71745 2.59938 -2.42412 0.17526 -0.65571 1.16398 0.50828
magnitude: 0.89655 au
magnitude: 2.27885 debye
