program: Orca
programVersion: 5.0.2
elementType: S S S P O O C C C C C C C C C H H H H H H H H H H H H H H H H H H H H H
charge: 0
multiplicity: 1
keywords: wb97x-d3
keywords: def2-TZVPP
keywords: def2/J RIJCOSX
keywords: DEFGRID2
keywords: scfconv7
keywords: smallprint printgap noloewdin
keywords: NOSOSCF
formula: C9H21O2PS3
InChI: InChI=1/C9H21O2PS3/c1-6-10-12(13,11-7-2)15-8-14-9(3,4)5/h6-8H2,1-5H3
36 atoms
S  1.611466 -1.513066 0.422481
S  -0.357929 0.348288 1.607895
S  -0.241244 1.426147 -1.613438
P  -1.360507 0.741409 -0.20984
O  -2.258975 -0.529865 -0.537661
O  -2.54926 1.667532 0.3202
C  3.19862 -1.378574 -0.499361
C  3.489143 -2.811757 -0.938614
C  3.045936 -0.481389 -1.720468
C  4.30501 -0.874569 0.419454
C  1.355609 0.15975 1.058764
C  -1.722099 -1.701432 -1.169057
C  -2.308285 3.036622 0.657118
C  -1.843672 -2.883552 -0.23783
C  -3.641006 3.704246 0.895304
H  3.597157 -3.480719 -0.084181
H  2.69655 -3.201794 -1.578862
H  4.41978 -2.841167 -1.508628
H  2.811817 0.549048 -1.454166
H  2.250428 -0.833422 -2.3757
H  3.978818 -0.467362 -2.289816
H  4.125507 0.14926 0.750931
H  4.404746 -1.504989 1.302924
H  5.26159 -0.876423 -0.108608
H  1.96628 0.351928 1.940908
H  1.567046 0.915677 0.301749
H  -2.30077 -1.852705 -2.080947
H  -0.680568 -1.542897 -1.457336
H  -1.682001 3.085725 1.552706
H  -1.766455 3.526147 -0.156325
H  -2.879072 -3.057099 0.05388
H  -1.478974 -3.780759 -0.73861
H  -1.247552 -2.737243 0.661723
H  -3.481845 4.747842 1.166536
H  -4.261125 3.679979 0.000159
H  -4.187553 3.225447 1.706965
totalener: -2042.18185376 hartree
nucrepener: 1714.57469968 hartree
electener: -3756.75655345 hartree
oneelecener: -6224.01269400 hartree
twoeener: 2467.25614056 hartree
kineticenergy: 2037.00725612 hartree
xcener: -124.867549964003 hartree
chargesum: -0.0000000
charge: -0.152544 -0.156315 -0.400469 0.629656 -0.298727 -0.310764 0.162482 -0.275156 -0.296094 -0.303806 -0.132152 0.024726 0.023577 -0.214540 -0.231816 0.103463 0.099955 0.085861 0.088909 0.098901 0.092084 0.083422 0.102257 0.090506 0.134681 0.119595 0.100225 0.062388 0.084293 0.092568 0.092397 0.078487 0.073849 0.074572 0.087728 0.085799
qa: -0.1525 -0.1563 -0.4005 0.6297 -0.2987 -0.3108 0.1625 -0.2752 -0.2961 -0.3038 -0.1322 0.0247 0.0236 -0.2145 -0.2318 0.1035 0.1000 0.0859 0.0889 0.0989 0.0921 0.0834 0.1023 0.0905 0.1347 0.1196 0.1002 0.0624 0.0843 0.0926 0.0924 0.0785 0.0738 0.0746 0.0877 0.0858
va: 2.2429 2.3017 2.0491 5.4476 2.1518 2.1541 3.9112 3.8755 3.9548 3.9239 4.0031 3.8797 3.8651 3.9260 3.9670 1.0129 1.0125 1.0073 1.0079 1.0106 1.0097 1.0052 1.0130 1.0082 0.9989 1.0414 0.9958 1.0292 0.9990 1.0060 1.0075 1.0108 1.0202 1.0074 1.0068 1.0054
dispcorr: -0.017859163 hartree
energy: -2042.199712926471
dipole: 13.59890 -12.97265 0.62625 -6.53988 6.52461 -0.01527 -2.68469 2.93054 0.24584
magnitude: 0.67295 au
magnitude: 1.71050 debye
