program: Orca
programVersion: 5.0.2
elementType: S S S P O O C C C C C C C C C H H H H H H H H H H H H H H H H H H H H H
charge: 0
multiplicity: 1
keywords: wb97x-d3
keywords: def2-TZVPP
keywords: def2/J RIJCOSX
keywords: DEFGRID2
keywords: scfconv7
keywords: smallprint printgap noloewdin
keywords: NOSOSCF
formula: C9H21O2PS3
InChI: InChI=1/C9H21O2PS3/c1-6-10-12(13,11-7-2)15-8-14-9(3,4)5/h6-8H2,1-5H3
36 atoms
S  2.984936 -0.199587 1.043512
S  -0.008956 -0.051557 1.319482
S  -0.776415 0.716308 -1.911661
P  -1.419181 0.494609 -0.105964
O  -2.533624 -0.641223 0.106058
O  -2.141198 1.758121 0.551622
C  3.182856 -1.294334 -0.424882
C  1.948802 -2.154002 -0.664506
C  3.511257 -0.469777 -1.663332
C  4.373954 -2.173406 -0.047392
C  1.511436 0.756191 0.6832
C  -2.358946 -1.946069 -0.455335
C  -3.086951 2.551324 -0.179945
C  -3.602149 -2.752434 -0.170732
C  -3.024245 3.969675 0.332416
H  1.094951 -1.560387 -0.991903
H  2.161172 -2.879059 -1.45438
H  1.662039 -2.701037 0.233179
H  2.686699 0.183678 -1.951465
H  3.699763 -1.133086 -2.511074
H  4.398073 0.144475 -1.509192
H  4.605993 -2.85024 -0.871819
H  5.266837 -1.579633 0.154821
H  4.161538 -2.779505 0.833943
H  1.620208 1.717625 1.180912
H  1.396182 0.936831 -0.386443
H  -2.182007 -1.859916 -1.530558
H  -1.478055 -2.41916 -0.0099
H  -2.855962 2.518436 -1.247847
H  -4.081456 2.123895 -0.035141
H  -4.48205 -2.296594 -0.624309
H  -3.490079 -3.753488 -0.587098
H  -3.777549 -2.851321 0.900264
H  -3.761048 4.579322 -0.190877
H  -3.241638 4.021582 1.398667
H  -2.04186 4.407383 0.158133
totalener: -2042.18353492 hartree
nucrepener: 1685.53909682 hartree
electener: -3727.72263174 hartree
oneelecener: -6165.83111805 hartree
twoeener: 2438.10848631 hartree
kineticenergy: 2036.99911398 hartree
xcener: -124.862065666610 hartree
chargesum: 0.0000000
charge: -0.120808 -0.123537 -0.418780 0.631316 -0.321363 -0.316620 0.146195 -0.285021 -0.295966 -0.278717 -0.130278 0.033297 0.010308 -0.231900 -0.221928 0.056004 0.088830 0.100064 0.096476 0.086333 0.097452 0.084522 0.102317 0.104520 0.151472 0.102949 0.097160 0.078090 0.087374 0.097126 0.084011 0.076501 0.086613 0.075687 0.087175 0.083125
qa: -0.1208 -0.1235 -0.4188 0.6313 -0.3214 -0.3166 0.1462 -0.2850 -0.2960 -0.2787 -0.1303 0.0333 0.0103 -0.2319 -0.2219 0.0560 0.0888 0.1001 0.0965 0.0863 0.0975 0.0845 0.1023 0.1045 0.1515 0.1029 0.0972 0.0781 0.0874 0.0971 0.0840 0.0765 0.0866 0.0757 0.0872 0.0831
va: 2.2598 2.3206 2.0269 5.4336 2.1192 2.1518 3.9482 3.9095 3.9431 3.8715 3.9810 3.8688 3.8816 3.9714 3.9465 1.0382 1.0140 1.0128 1.0073 1.0062 1.0149 1.0068 1.0129 1.0130 1.0011 1.0700 1.0045 0.9911 1.0113 0.9932 1.0069 1.0075 1.0052 1.0091 1.0054 1.0088
dispcorr: -0.017094047 hartree
energy: -2042.200628970143
dipole: 3.54142 -4.05908 -0.51766 -7.83059 7.55958 -0.27101 -7.18775 6.92771 -0.26005
magnitude: 0.63956 au
magnitude: 1.62564 debye
