program: Orca
programVersion: 5.0.2
elementType: S S S P O O C C C C C C C C C H H H H H H H H H H H H H H H H H H H H H
charge: 0
multiplicity: 1
keywords: wb97x-d3
keywords: def2-TZVPP
keywords: def2/J RIJCOSX
keywords: DEFGRID2
keywords: scfconv7
keywords: smallprint printgap noloewdin
keywords: NOSOSCF
formula: C9H21O2PS3
InChI: InChI=1/C9H21O2PS3/c1-6-10-12(13,11-7-2)15-8-14-9(3,4)5/h6-8H2,1-5H3
36 atoms
S  2.961929 -0.20373 1.050873
S  -0.038987 -0.099089 1.306563
S  -0.79237 0.598963 -1.947158
P  -1.435524 0.439848 -0.135224
O  -2.575152 -0.663671 0.106952
O  -2.125275 1.737049 0.489723
C  3.182622 -1.290488 -0.421442
C  1.964885 -2.172174 -0.662755
C  3.495468 -0.456544 -1.657495
C  4.390501 -2.146993 -0.04578
C  1.476608 0.732175 0.687778
C  -2.431684 -1.983992 -0.426952
C  -3.024515 2.557493 -0.269195
C  -3.673655 -2.768889 -0.08229
C  -3.050108 3.934023 0.349709
H  1.099659 -1.593807 -0.987085
H  2.189857 -2.890229 -1.455492
H  1.689707 -2.727741 0.233244
H  2.65719 0.17839 -1.946995
H  3.700637 -1.114395 -2.50557
H  4.368127 0.176728 -1.500293
H  5.271814 -1.536305 0.15643
H  4.190209 -2.757925 0.834996
H  4.634928 -2.818322 -0.871016
H  1.567892 1.691555 1.192919
H  1.367383 0.918044 -0.381531
H  -2.288619 -1.925774 -1.508581
H  -1.542182 -2.456431 0.001015
H  -2.692936 2.606741 -1.309438
H  -4.01703 2.101352 -0.25243
H  -4.562856 -2.312083 -0.514856
H  -3.587613 -3.779517 -0.480662
H  -3.812898 -2.84229 0.995502
H  -3.747768 4.567028 -0.198649
H  -3.373182 3.900648 1.389469
H  -2.067782 4.403222 0.308515
totalener: -2042.18368541 hartree
nucrepener: 1685.04017733 hartree
electener: -3727.22386273 hartree
oneelecener: -6164.84249772 hartree
twoeener: 2437.61863499 hartree
kineticenergy: 2037.00387230 hartree
xcener: -124.862964518493 hartree
chargesum: -0.0000000
charge: -0.121082 -0.123985 -0.419335 0.632676 -0.321895 -0.315566 0.144920 -0.282261 -0.296134 -0.278616 -0.130731 0.030944 0.006840 -0.231101 -0.222580 0.057056 0.088177 0.099300 0.096358 0.086350 0.097451 0.102258 0.104404 0.084522 0.151395 0.102518 0.098070 0.079443 0.091269 0.097065 0.084005 0.076553 0.086600 0.075310 0.087429 0.082377
qa: -0.1211 -0.1240 -0.4193 0.6327 -0.3219 -0.3156 0.1449 -0.2823 -0.2961 -0.2786 -0.1307 0.0309 0.0068 -0.2311 -0.2226 0.0571 0.0882 0.0993 0.0964 0.0863 0.0975 0.1023 0.1044 0.0845 0.1514 0.1025 0.0981 0.0794 0.0913 0.0971 0.0840 0.0766 0.0866 0.0753 0.0874 0.0824
va: 2.2595 2.3185 2.0263 5.4344 2.1197 2.1519 3.9489 3.9077 3.9428 3.8709 3.9825 3.8690 3.8857 3.9698 3.9485 1.0398 1.0141 1.0133 1.0072 1.0063 1.0150 1.0130 1.0130 1.0068 1.0015 1.0693 1.0048 0.9913 1.0086 0.9921 1.0068 1.0076 1.0054 1.0087 1.0053 1.0083
dispcorr: -0.017032933 hartree
energy: -2042.200718340986
dipole: 3.58248 -4.10307 -0.52059 -7.36299 7.13718 -0.22580 -6.79104 6.54518 -0.24586
magnitude: 0.61843 au
magnitude: 1.57192 debye
