program: Orca
programVersion: 5.0.2
elementType: S S S P O O C C C C C C C C C H H H H H H H H H H H H H H H H H H H H H
charge: 0
multiplicity: 1
keywords: wb97x-d3
keywords: def2-TZVPP
keywords: def2/J RIJCOSX
keywords: DEFGRID2
keywords: scfconv7
keywords: smallprint printgap noloewdin
keywords: NOSOSCF
formula: C9H21O2PS3
InChI: InChI=1/C9H21O2PS3/c1-6-10-12(13,11-7-2)15-8-14-9(3,4)5/h6-8H2,1-5H3
36 atoms
S  2.918784 -1.568816 0.554339
S  0.00884 -1.067048 1.290246
S  -1.013036 -0.035907 -1.803371
P  -1.268863 0.073774 0.106102
O  -2.729691 -0.31856 0.643423
O  -1.103665 1.515933 0.770963
C  3.423844 0.003686 -0.259362
C  2.541203 1.169614 0.164223
C  4.852505 0.212591 0.23923
C  3.414475 -0.154934 -1.77489
C  1.200878 -1.783064 0.091239
C  -3.338352 -1.551097 0.242914
C  -1.833477 2.645315 0.2703
C  -4.364017 -1.318617 -0.84207
C  -1.096877 3.899765 0.671934
H  1.540905 1.097823 -0.259773
H  2.448636 1.237589 1.247198
H  2.975257 2.103583 -0.20263
H  5.268746 1.116343 -0.209893
H  5.501763 -0.621261 -0.032323
H  4.885888 0.331195 1.322741
H  3.786512 0.757861 -2.246958
H  4.047063 -0.983326 -2.092725
H  2.408398 -0.323122 -2.161828
H  0.984066 -1.387385 -0.90192
H  1.01313 -2.854532 0.066062
H  -2.579487 -2.26584 -0.089945
H  -3.798851 -1.964685 1.140344
H  -1.918644 2.579876 -0.817891
H  -2.841441 2.629042 0.690443
H  -5.126466 -0.610579 -0.518701
H  -3.895238 -0.937969 -1.74816
H  -4.860804 -2.258285 -1.085399
H  -1.002042 3.977293 1.754416
H  -0.099184 3.926898 0.235171
H  -1.644219 4.773704 0.318688
totalener: -2042.18104404 hartree
nucrepener: 1703.86098401 hartree
electener: -3746.04202804 hartree
oneelecener: -6202.53406053 hartree
twoeener: 2456.49203249 hartree
kineticenergy: 2037.01017179 hartree
xcener: -124.864058614654 hartree
chargesum: -0.0000000
charge: -0.118997 -0.119623 -0.411998 0.623407 -0.334027 -0.309036 0.145978 -0.283632 -0.278746 -0.294089 -0.134818 0.028625 0.017360 -0.229654 -0.225759 0.055560 0.107466 0.086957 0.083264 0.101450 0.105652 0.085412 0.096774 0.094642 0.107527 0.147515 0.071283 0.097772 0.085545 0.097974 0.082183 0.088681 0.080004 0.087514 0.082965 0.078869
qa: -0.1190 -0.1196 -0.4120 0.6234 -0.3340 -0.3090 0.1460 -0.2836 -0.2787 -0.2941 -0.1348 0.0286 0.0174 -0.2297 -0.2258 0.0556 0.1075 0.0870 0.0833 0.1015 0.1057 0.0854 0.0968 0.0946 0.1075 0.1475 0.0713 0.0978 0.0855 0.0980 0.0822 0.0887 0.0800 0.0875 0.0830 0.0789
va: 2.2560 2.3242 2.0260 5.4230 2.1108 2.1222 3.9546 3.9135 3.8713 3.9395 3.9914 3.9122 3.8799 3.9349 3.9506 1.0318 1.0154 1.0112 1.0069 1.0131 1.0127 1.0064 1.0155 1.0106 1.0726 0.9985 1.0109 0.9932 1.0098 0.9947 1.0052 1.0208 1.0114 1.0054 1.0063 1.0094
dispcorr: -0.018016042 hartree
energy: -2042.199060077743
dipole: 6.01556 -6.55926 -0.54371 10.77445 -10.34859 0.42586 -5.79227 5.74073 -0.05154
magnitude: 0.69255 au
magnitude: 1.76033 debye
