program: Orca
programVersion: 5.0.2
elementType: S S S P O O C C C C C C C C C H H H H H H H H H H H H H H H H H H H H H
charge: 0
multiplicity: 1
keywords: wb97x-d3
keywords: def2-TZVPP
keywords: def2/J RIJCOSX
keywords: DEFGRID2
keywords: scfconv7
keywords: smallprint printgap noloewdin
keywords: NOSOSCF
formula: C9H21O2PS3
InChI: InChI=1/C9H21O2PS3/c1-6-10-12(13,11-7-2)15-8-14-9(3,4)5/h6-8H2,1-5H3
36 atoms
S  2.65543 -1.358798 0.516154
S  -0.052008 -0.329726 1.334975
S  -1.171926 0.614603 -1.755409
P  -1.579777 0.377942 0.116735
O  -2.806229 -0.585883 0.450459
O  -2.010112 1.704344 0.911681
C  3.280925 0.000376 -0.561295
C  2.579565 1.321428 -0.274588
C  4.758416 0.095908 -0.186111
C  3.134899 -0.377355 -2.030185
C  0.893198 -1.401425 0.184952
C  -3.995499 -0.583783 -0.35669
C  -1.238042 2.904169 0.805028
C  -4.038009 -1.813697 -1.231871
C  -1.975636 4.005909 1.52586
H  3.069863 2.120725 -0.8363
H  1.534779 1.304658 -0.584602
H  2.619465 1.574764 0.784432
H  5.281345 -0.846798 -0.354852
H  4.888867 0.375301 0.859937
H  5.243052 0.857843 -0.799518
H  3.633712 -1.32068 -2.250742
H  2.089217 -0.463317 -2.328511
H  3.579617 0.397979 -2.658955
H  0.666523 -1.108609 -0.841104
H  0.561803 -2.427966 0.327098
H  -4.831356 -0.564113 0.342603
H  -4.050414 0.320774 -0.966603
H  -0.25105 2.740939 1.248171
H  -1.092244 3.153109 -0.249285
H  -4.98007 -1.84305 -1.780348
H  -3.22435 -1.802739 -1.956382
H  -3.966663 -2.724236 -0.637884
H  -1.401834 4.930358 1.463207
H  -2.952384 4.186205 1.078565
H  -2.117033 3.767938 2.579622
totalener: -2042.18274435 hartree
nucrepener: 1694.86425912 hartree
electener: -3737.04700347 hartree
oneelecener: -6184.47532160 hartree
twoeener: 2447.42831813 hartree
kineticenergy: 2037.00479952 hartree
xcener: -124.863754780474 hartree
chargesum: -0.0000000
charge: -0.120633 -0.123030 -0.419863 0.635681 -0.321035 -0.319146 0.145534 -0.286822 -0.278188 -0.295297 -0.128794 0.022396 0.029074 -0.224000 -0.232258 0.089103 0.056628 0.100058 0.102028 0.104550 0.084379 0.097651 0.096289 0.086379 0.100422 0.151769 0.094916 0.079181 0.081151 0.096117 0.079286 0.083276 0.085576 0.076026 0.084580 0.087015
qa: -0.1206 -0.1230 -0.4199 0.6357 -0.3210 -0.3191 0.1455 -0.2868 -0.2782 -0.2953 -0.1288 0.0224 0.0291 -0.2240 -0.2323 0.0891 0.0566 0.1001 0.1020 0.1045 0.0844 0.0977 0.0963 0.0864 0.1004 0.1518 0.0949 0.0792 0.0812 0.0961 0.0793 0.0833 0.0856 0.0760 0.0846 0.0870
va: 2.2579 2.3227 2.0153 5.4247 2.1383 2.1258 3.9481 3.9087 3.8727 3.9434 3.9796 3.9054 3.8659 3.9213 3.9715 1.0143 1.0407 1.0129 1.0128 1.0127 1.0068 1.0151 1.0067 1.0063 1.0721 1.0009 0.9952 1.0114 0.9918 1.0049 1.0116 1.0206 1.0049 1.0076 1.0072 1.0051
dispcorr: -0.017537293 hartree
energy: -2042.200281643547
dipole: 7.60433 -7.89816 -0.29382 7.80279 -7.27396 0.52883 -6.87751 6.75896 -0.11855
magnitude: 0.61648 au
magnitude: 1.56696 debye
