program: Orca
programVersion: 5.0.2
elementType: S S S P O O C C C C C C C C C H H H H H H H H H H H H H H H H H H H H H
charge: 0
multiplicity: 1
keywords: wb97x-d3
keywords: def2-TZVPP
keywords: def2/J RIJCOSX
keywords: DEFGRID2
keywords: scfconv7
keywords: smallprint printgap noloewdin
keywords: NOSOSCF
formula: C9H21O2PS3
InChI: InChI=1/C9H21O2PS3/c1-6-10-12(13,11-7-2)15-8-14-9(3,4)5/h6-8H2,1-5H3
36 atoms
S  2.837491 -1.503573 0.405008
S  -0.079638 -1.109265 1.202372
S  -1.11992 0.08178 -1.827746
P  -1.353282 0.10358 0.087717
O  -2.812079 -0.297165 0.622419
O  -1.160836 1.509447 0.818747
C  3.301564 0.095336 -0.381434
C  2.417634 1.238661 0.09642
C  4.740309 0.309641 0.084945
C  3.253663 -0.023175 -1.899886
C  1.117009 -1.744276 -0.037396
C  -3.45249 -1.489719 0.155634
C  -1.837636 2.686824 0.355524
C  -4.496261 -1.165909 -0.888197
C  -1.043772 3.893667 0.793779
H  2.35154 1.274712 1.182944
H  2.83142 2.18808 -0.254338
H  1.408292 1.166168 -0.305245
H  5.134518 1.227718 -0.354913
H  5.39168 -0.510403 -0.221052
H  4.800161 0.405755 1.169533
H  3.603923 0.905813 -2.356698
H  3.885768 -0.836089 -2.256449
H  2.239301 -0.19102 -2.26468
H  0.873737 -1.319986 -1.012506
H  0.956162 -2.818693 -0.09748
H  -2.715131 -2.193919 -0.24154
H  -3.901868 -1.953189 1.034113
H  -1.927515 2.659861 -0.733936
H  -2.844977 2.703727 0.777609
H  -5.233331 -0.461662 -0.503347
H  -4.038471 -0.740178 -1.779622
H  -5.021858 -2.076277 -1.177626
H  -0.045155 3.886578 0.357933
H  -1.548926 4.802207 0.465584
H  -0.946628 3.935778 1.878026
totalener: -2042.18090594 hartree
nucrepener: 1706.38338110 hartree
electener: -3748.56428704 hartree
oneelecener: -6207.57992761 hartree
twoeener: 2459.01564057 hartree
kineticenergy: 2037.00912393 hartree
xcener: -124.863964522725 hartree
chargesum: -0.0000000
charge: -0.119096 -0.119064 -0.412664 0.622986 -0.333596 -0.308884 0.147810 -0.284471 -0.279405 -0.294606 -0.135301 0.028651 0.015464 -0.229874 -0.225270 0.108788 0.087035 0.051857 0.083136 0.101727 0.105566 0.085267 0.097112 0.094944 0.107652 0.147916 0.072465 0.097497 0.086687 0.098831 0.082384 0.088299 0.080084 0.082117 0.080060 0.087895
qa: -0.1191 -0.1191 -0.4127 0.6230 -0.3336 -0.3089 0.1478 -0.2845 -0.2794 -0.2946 -0.1353 0.0287 0.0155 -0.2299 -0.2253 0.1088 0.0870 0.0519 0.0831 0.1017 0.1056 0.0853 0.0971 0.0949 0.1077 0.1479 0.0725 0.0975 0.0867 0.0988 0.0824 0.0883 0.0801 0.0821 0.0801 0.0879
va: 2.2545 2.3252 2.0246 5.4251 2.1123 2.1197 3.9584 3.9113 3.8718 3.9378 3.9900 3.9095 3.8773 3.9356 3.9490 1.0151 1.0108 1.0340 1.0069 1.0134 1.0124 1.0066 1.0155 1.0110 1.0733 0.9987 1.0112 0.9934 1.0108 0.9949 1.0053 1.0203 1.0114 1.0060 1.0097 1.0053
dispcorr: -0.018184286 hartree
energy: -2042.199090229345
dipole: 6.00671 -6.54957 -0.54286 11.35622 -10.91495 0.44127 -5.76465 5.70828 -0.05637
magnitude: 0.70185 au
magnitude: 1.78397 debye
